program: Orca
programVersion: 5.0.2
elementType: Si F O O C C C C C C C C C C C C C C C C C C C C C C C C C H H H H H H H H H H H H H H H H H H H H H H H H H H H H H
charge: 0
multiplicity: 1
keywords: wb97x-d3
keywords: def2-TZVPP
keywords: def2/J RIJCOSX
keywords: DEFGRID2
keywords: scfconv7
keywords: smallprint printgap noloewdin
keywords: NOSOSCF
formula: C25H29FO2Si
InChI: InChI=1/C25H29FO2Si/c1-4-27-21-13-15-23(16-14-21)29(2,3)18-8-9-20-12-17-24(26)25(19-20)28-22-10-6-5-7-11-22/h5-7,10-17,19H,4,8-9,18H2,1-3H3
58 atoms
Si -3.437749 1.42397 -0.328292
F  2.397929 -2.484325 0.671788
O  1.932957 2.622977 2.221431
O  1.549948 -2.176289 -1.910466
C  -3.37989 -0.31729 -1.066869
C  -3.759154 -1.455154 -0.112276
C  -1.769257 1.772366 0.481331
C  -4.806773 1.547133 0.959352
C  -3.724077 2.686353 -1.692375
C  -3.099041 -2.795556 -0.461363
C  -1.135727 0.826922 1.290219
C  -1.092365 2.98125 0.289334
C  -1.623333 -2.766858 -0.179635
C  0.100697 1.054054 1.882959
C  0.13564 3.235321 0.874911
C  0.745119 2.272806 1.681282
C  -0.699212 -2.487794 -1.18312
C  -1.156849 -2.941143 1.121806
C  0.652933 -2.388714 -0.897746
C  0.193949 -2.843359 1.422116
C  1.085398 -2.569505 0.407587
C  2.629229 1.720086 3.075281
C  3.428069 0.686056 2.314392
C  2.325149 -1.040932 -1.872194
C  1.892594 0.143087 -1.289726
C  3.567781 -1.120426 -2.486448
C  2.730972 1.250863 -1.314506
C  4.389281 -0.00379 -2.507507
C  3.979541 1.184729 -1.9162
H  -4.020472 -0.361296 -1.953226
H  -2.360492 -0.452487 -1.443754
H  -4.844405 -1.580253 -0.120493
H  -3.503462 -1.218575 0.924925
H  -4.872563 2.555819 1.372018
H  -5.781854 1.304348 0.531369
H  -4.637137 0.865216 1.795126
H  -2.945004 2.642482 -2.455955
H  -4.677976 2.499427 -2.190279
H  -3.755245 3.709044 -1.311624
H  -3.56416 -3.587307 0.130548
H  -3.279994 -3.034456 -1.512077
H  -1.603545 -0.132938 1.477142
H  -1.526516 3.755998 -0.332156
H  0.536628 0.272717 2.491165
H  0.632621 4.183637 0.709982
H  -1.026924 -2.353895 -2.207245
H  -1.857596 -3.157374 1.918597
H  0.554011 -2.98855 2.432663
H  1.942458 1.248557 3.783659
H  3.301091 2.350821 3.65735
H  2.800489 -0.003678 1.75125
H  4.125427 1.159152 1.622507
H  4.01143 0.096166 3.022364
H  0.918106 0.217277 -0.82194
H  3.88863 -2.050107 -2.939057
H  2.397047 2.173369 -0.857113
H  5.359417 -0.069101 -2.982316
H  4.62608 2.051831 -1.928119
elementType: Si F O C H
totalener: -1510.05076338 hartree
nucrepener: 3033.44238169 hartree
electener: -4543.49314507 hartree
oneelecener: -8097.38216297 hartree
twoeener: 3553.88901791 hartree
cpcmener: -0.02626349 hartree
kineticenergy: 1503.90313016 hartree
xcener: -135.232121521911 hartree
chargesum: -0.0000000
charge: 0.498497 -0.221424 -0.345398 -0.345935 -0.287759 -0.151507 -0.173128 -0.414177 -0.462498 -0.078862 -0.180530 -0.076906 0.094100 -0.238202 -0.298975 0.318362 -0.285935 -0.243833 0.237531 -0.168458 0.221829 0.046115 -0.244263 0.242433 -0.133267 -0.213362 -0.211194 -0.141133 -0.163780 0.098445 0.089836 0.094086 0.077152 0.107147 0.105841 0.101958 0.108226 0.107147 0.099770 0.096981 0.086505 0.165625 0.143068 0.144752 0.133552 0.140850 0.143191 0.152212 0.088271 0.109216 0.056670 0.086056 0.106215 0.140107 0.146868 0.171060 0.160394 0.160460
qa: 0.4985 -0.2214 -0.3454 -0.3459 -0.2878 -0.1515 -0.1731 -0.4142 -0.4625 -0.0789 -0.1805 -0.0769 0.0941 -0.2382 -0.2990 0.3184 -0.2859 -0.2438 0.2375 -0.1685 0.2218 0.0461 -0.2443 0.2424 -0.1333 -0.2134 -0.2112 -0.1411 -0.1638 0.0984 0.0898 0.0941 0.0772 0.1071 0.1058 0.1020 0.1082 0.1071 0.0998 0.0970 0.0865 0.1656 0.1431 0.1448 0.1336 0.1409 0.1432 0.1522 0.0883 0.1092 0.0567 0.0861 0.1062 0.1401 0.1469 0.1711 0.1604 0.1605
va: 4.1008 1.0616 2.0448 2.0579 3.8167 3.9107 3.7569 3.8751 3.9226 3.8321 3.8223 3.8140 3.5151 3.8427 4.0052 3.6940 4.0034 3.8843 3.6764 3.8547 3.9399 3.8663 3.9139 3.7144 3.7717 3.9737 3.8678 3.9102 3.8828 1.0089 1.0096 1.0082 0.9959 1.0102 1.0067 1.0091 1.0084 1.0120 1.0110 1.0056 1.0090 0.9618 0.9850 1.0043 1.0154 1.0135 1.0029 0.9968 0.9969 0.9907 0.9982 1.0075 1.0131 1.0088 1.0084 0.9875 0.9872 0.9900
dispcorr: -0.036596946 hartree
energy: -1510.087360328801
dipole: -20.25910 19.34845 -0.91065 12.10569 -12.48067 -0.37499 3.75117 -2.98617 0.76500
magnitude: 1.24705 au
magnitude: 3.16975 debye
