program: Gaussian 09
title: 000068186
version: EM64L-G09RevD.01
frameworkgroup: C1[X(C22H26FN3O2)]
method: RPBEPBE
basis: SDD
operation: Freq
keyword: #p
keyword: freq=noraman
keyword: PBEPBE/SDD
title: #p freq=noraman PBEPBE/SDD
converged: NO YES NO NO
title: Mulliken charges:
elementType: F O O N N N C C C C C C C C C C C C C C C C C C C C C C H H H H H H H H H H H H H H H H H H H H H H H H H H
charge: -0.214007 -0.247558 -0.278505 -0.270170 -0.094337 -0.370645 0.274526 -0.467529 -0.475838 -0.390679 -0.381713 0.084983 -0.339404 -0.329336 0.408559 -0.446911 -0.372692 -0.341537 -0.286515 -0.236411 -0.262225 -0.267342 0.367226 -0.308848 -0.348027 -0.367635 -0.340477 0.308765 0.241181 0.208001 0.208181 0.240085 0.231357 0.213623 0.197748 0.237601 0.232171 0.234185 0.324025 0.225752 0.196309 0.222148 0.197387 0.228950 0.235106 0.228955 0.208734 0.220619 0.220155 0.228031 0.255221 0.253771 0.250515 0.254474
chargesum: 0.00000
title: Mulliken charges with hydrogens summed into heavy atoms:
elementType: F O O N N N C C C C C C C C C C C C C C C C C C C C C C
charge: -0.214007 -0.247558 -0.278505 -0.270170 -0.094337 -0.046620 0.274526 -0.018347 -0.027572 0.054300 0.053636 0.084983 0.126952 0.092725 0.408559 -0.027376 -0.143743 -0.106431 0.151174 -0.015792 -0.042070 -0.039312 0.367226 -0.053627 -0.094256 -0.117120 -0.086004 0.308765
polarizability: 2.81914147e+02 1.21413545e+01 3.08090179e+02 -7.97656202e+00 1.35921642e+01 1.84483133e+02
1716.lowfreq: 0.0004 0.0006 0.0006 0.5017 2.3656 5.3688 8.4850 14.2250 23.6794
frequency: 8.3086 14.1640 23.6655 35.0562 47.0875 57.0960 65.2595 99.1930 101.9811 115.9528 153.0860 162.2155 171.8175 191.1960 203.8656 226.7956 231.5958 258.2689 269.3275 292.3628 308.1582 325.3108 340.2642 351.4562 354.3926 373.7850 387.0084 406.0757 418.6934 419.2760 425.7008 476.0885 489.0771 506.0679 515.3259 517.1131 544.0898 557.3760 564.2045 613.3617 625.7108 637.2625 663.5521 695.6691 702.2913 703.2122 715.7282 719.8272 736.3880 750.6603 792.7943 802.2295 803.8363 813.3071 824.1836 834.4842 844.3803 872.8710 888.2470 915.9382 924.5123 927.2934 941.3540 946.6085 956.0105 968.5329 976.6325 977.3071 992.9400 996.3572 1021.1456 1028.1967 1038.4833 1047.2880 1064.3851 1078.9397 1082.0773 1093.2490 1102.0377 1104.0664 1113.9432 1121.6913 1147.8133 1152.7933 1158.0711 1171.0216 1176.1096 1183.2171 1184.2539 1190.8299 1204.1096 1207.1136 1223.7814 1231.9496 1244.6585 1270.0906 1285.4013 1290.0679 1296.3119 1300.9729 1324.1364 1326.2248 1339.3371 1343.3851 1350.9297 1353.1306 1365.2297 1367.7158 1370.6669 1380.3637 1382.2802 1395.5351 1415.7789 1416.8473 1447.3735 1450.6030 1456.7554 1465.1193 1466.8098 1469.4159 1474.3715 1488.6279 1493.8169 1498.2273 1522.6117 1576.9425 1597.9199 1618.5854 1621.6613 1661.0543 2878.1092 2906.5487 2907.6612 2913.6757 2937.6579 2959.6264 2998.2136 3006.3976 3008.2255 3027.4582 3027.9656 3033.1044 3042.4323 3059.8033 3079.8425 3081.8689 3123.0690 3129.4326 3151.6770 3159.6270 3160.5177 3164.6070 3178.4821 3179.2148 3182.0675 3585.8677
redmass: 7.1588 6.0345 5.0106 4.3919 3.8374 5.6060 5.8063 4.3816 4.8293 4.4199 5.5571 3.6865 5.0396 3.6397 2.7085 3.8775 2.9799 4.2921 2.3167 2.7260 2.7196 5.0776 6.9370 3.5179 6.6238 3.0544 2.2761 4.1779 3.0768 2.9878 3.4033 2.9639 3.1884 2.4567 2.8285 2.9653 3.4839 1.1870 4.1551 6.3667 6.9686 4.9624 4.1619 1.8186 3.5493 3.1369 6.7362 6.3581 3.4664 1.8915 1.3316 1.8192 2.3525 1.2894 1.6553 2.5141 3.2502 1.4095 2.8577 1.3788 2.8793 2.4596 1.3375 2.6447 1.3533 2.7147 4.0728 1.3083 3.2673 2.7130 2.2641 1.6457 2.0791 2.2082 2.0114 2.2892 1.4456 1.7452 2.1366 1.3340 2.6275 4.7196 2.2898 1.4103 2.5182 1.3427 1.0865 2.0639 2.2591 1.0743 1.1665 1.1453 1.7147 3.2782 1.9286 1.3917 1.2935 1.3024 1.4780 1.8613 1.3409 1.5898 1.3641 1.5018 1.3788 1.5710 1.8561 1.6454 1.7896 3.3931 3.8124 1.4236 3.7958 1.9089 1.0908 2.4999 1.0865 1.1263 1.1425 1.1441 1.0790 1.1357 2.0184 2.3688 1.1204 5.9215 7.5762 6.7144 6.0584 7.5823 1.0710 1.0693 1.0548 1.0678 1.1082 1.0553 1.0630 1.0645 1.0659 1.1009 1.0944 1.0904 1.0913 1.0986 1.0975 1.0976 1.0847 1.0891 1.0922 1.0879 1.0883 1.0976 1.0968 1.0952 1.0976 1.0792
irintensity: 0.1429 0.0725 0.0957 0.3906 2.3885 0.4048 3.2358 0.3636 1.6921 0.0735 2.4299 3.1330 8.3158 2.0863 4.0488 0.9894 3.4715 0.6511 1.1670 3.6340 2.3920 4.9852 1.6189 2.8405 0.6367 0.3223 6.7554 14.0588 0.5086 0.2263 2.9212 2.9470 0.8119 22.4334 10.1932 3.9254 4.9451 108.0518 4.7210 0.4508 0.1809 7.6586 11.4048 39.6359 4.5851 37.4330 0.4633 12.7872 5.0705 82.8229 10.4761 5.9715 3.6742 0.0385 102.4527 1.7356 1.4858 4.7163 1.2250 0.4039 19.3110 25.4549 0.1144 47.9197 0.0139 26.3869 8.0586 0.1963 10.5719 7.5891 19.3134 2.3939 13.1709 1.3883 22.1627 25.7336 3.1134 0.0694 10.1494 19.8913 38.5866 2.9843 11.0222 14.4033 16.3173 13.2373 3.2461 214.4084 38.6895 3.7096 15.6053 10.8723 54.5279 57.5840 63.2302 1.3943 9.1727 2.0289 23.4529 50.8356 0.0868 0.2951 15.8062 3.1601 6.2641 30.1739 4.9965 63.3083 112.9403 4.2575 22.7978 3.1203 1.9753 38.1401 14.5152 0.7239 7.2480 45.4080 88.5589 8.3667 14.0857 56.9898 134.8400 172.8809 7.6852 11.4119 6.3823 5.6787 160.3658 341.5428 83.7345 49.9768 96.3386 81.9412 44.9814 29.0539 25.7132 24.0453 23.1344 12.8872 59.1470 27.7907 27.9189 52.7410 5.0513 34.7327 7.0931 12.8650 34.7145 11.5137 1.9212 29.6435 8.1601 4.7182 0.0483 46.5779
temp: 298.150 k
press: 1.00000 atm
elementType: 9 8 8 7 7 7 6 6 6 6 6 6 6 6 6 6 6 6 6 6 6 6 6 6 6 6 6 6 1 1 1 1 1 1 1 1 1 1 1 1 1 1 1 1 1 1 1 1 1 1 1 1 1 1
symmnumber: 1
zpe: 1164624.0 jmol-1
zpe.correction: 0.443582 hartree
zpe.thermalcorrener: 0.468675 hartree
zpe.thermalcorrenthalpy: 0.469619 hartree
zpe.thermalcorrgfe: 0.385340 hartree
zpe.sumelectzpe: -1266.401602 hartree
zpe.sumelectthermal: -1266.376509 hartree
zpe.sumelectthermalent: -1266.375565 hartree
zpe.sumelectthermalfe: -1266.459844 hartree
dipole: -4.5517 -0.2556 1.2194
dipole: 4.7191
quadrupole: -160.6201 -175.7621 -160.8802
quadrupole: -17.4805 7.8338 0.3408
quadrupole: 5.1340 -10.0079 4.8740 -17.4805 7.8338 0.3408
hfenergy: -1266.8451839 hartree
pointgroup: C01 [X(C22H26F1N3O2)]
dipole: 1.75788 -0.1066019 -0.5879323 debye
polarizability: 281.0850163|-14.6494145|304.7154599|-12.7954151|-22.371964|188.6869826 unknown
InChI: InChI=1S/C22H26FN3O2/c23-18-7-9-20(10-8-18)28-16-4-13-25-14-11-22(12-15-25)21(27)24-17-26(22)19-5-2-1-3-6-19/h1-3,5-10,24H,4,11-17H2
charge 0 multiplicity 1
54 atoms
F  -6.794342 2.453872 1.372139
O  3.809417 -2.931891 0.916227
O  -3.525371 -1.878896 -0.034639
N  3.478303 0.546885 0.036612
N  0.189696 -2.213009 -0.051413
N  5.062598 -0.951237 0.739432
C  2.764572 -0.758526 0.182408
C  1.655854 -0.71227 1.285562
C  2.205266 -1.283129 -1.180692
C  0.765673 -1.971004 1.2990
C  1.281459 -2.507073 -1.017221
C  3.905056 -1.701294 0.654333
C  4.912125 0.454013 0.371641
C  -0.863752 -3.261725 -0.041031
C  2.946792 1.778203 -0.382254
C  -1.839141 -3.127092 -1.231643
C  3.805532 2.919531 -0.481706
C  1.568324 1.961629 -0.721146
C  -2.615037 -1.810119 -1.198897
C  3.309439 4.171114 -0.899161
C  1.090121 3.220043 -1.135471
C  1.947473 4.340185 -1.232079
C  -4.308292 -0.752917 0.250853
C  -4.297781 0.446362 -0.507608
C  -5.156147 -0.871565 1.38318
C  -5.133313 1.52328 -0.129767
C  -5.988938 0.198335 1.7620
C  -5.959085 1.378039 0.994246
H  1.016846 0.169729 1.116139
H  2.13636 -0.582751 2.2739
H  3.053582 -1.539826 -1.843402
H  1.640376 -0.473928 -1.672141
H  1.354051 -2.849067 1.654776
H  -0.066715 -1.807417 2.008368
H  0.838589 -2.745417 -2.001649
H  1.876857 -3.392036 -0.689707
H  5.556171 0.718015 -0.496878
H  5.182031 1.127916 1.214921
H  5.949588 -1.360206 1.031813
H  -1.446394 -3.150965 0.891395
H  -0.424075 -4.289468 -0.03464
H  -2.552794 -3.972597 -1.216158
H  -1.290745 -3.184184 -2.192069
H  4.868302 2.840454 -0.233281
H  0.859656 1.133223 -0.661279
H  -1.908945 -0.96536 -1.069809
H  -3.214185 -1.668205 -2.121428
H  3.999529 5.020648 -0.96237
H  0.027075 3.322436 -1.383294
H  1.56493 5.313741 -1.55436
H  -3.653848 0.555226 -1.384195
H  -5.147556 -1.807222 1.949716
H  -5.14334 2.457813 -0.698359
H  -6.648547 0.125905 2.631486
