program: Gaussian 09
title: 000068026
version: EM64L-G09RevD.01
frameworkgroup: CS[SG(C2H2ClF)]
method: RPBEPBE
basis: SDD
operation: Freq
keyword: #p
keyword: freq=noraman
keyword: PBEPBE/SDD
title: #p freq=noraman PBEPBE/SDD
converged: NO NO NO NO
title: Mulliken charges:
elementType: Cl F C C H H
charge: -0.016815 -0.189771 -0.366729 0.049627 0.285633 0.238055
chargesum: 0.00000
title: Mulliken charges with hydrogens summed into heavy atoms:
elementType: Cl F C C
charge: -0.016815 -0.189771 -0.081096 0.287682
polarizability: 4.92465765e+01 -8.09635419e-01 2.45743443e+01 1.59410431e-09 -1.05580793e-09 1.23524692e+01
1716.lowfreq: -0.0032 -0.0022 0.0022 9.1010 14.9251 35.9528 247.8381 251.2944 408.2228
frequency: 247.8377 251.2912 408.2228 758.8768 799.9384 902.5433 1036.7698 1199.8022 1272.2039 1636.1760 3191.7171 3216.8597
redmass: 6.0661 8.0490 14.6969 1.8406 5.7302 1.0893 7.8908 1.1414 1.1609 6.6023 1.0951 1.0982
irintensity: 7.2821 1.9478 1.5760 5.6321 53.2814 113.6936 123.7480 1.6522 1.3063 10.9095 6.8770 7.0003
temp: 298.150 k
press: 1.00000 atm
elementType: 17 9 6 6 1 1
symmnumber: 1
zpe: 89254.8 jmol-1
zpe.correction: 0.033995 hartree
zpe.thermalcorrener: 0.038391 hartree
zpe.thermalcorrenthalpy: 0.039335 hartree
zpe.thermalcorrgfe: 0.006634 hartree
zpe.sumelectzpe: -636.961049 hartree
zpe.sumelectthermal: -636.956654 hartree
zpe.sumelectthermalent: -636.955710 hartree
zpe.sumelectthermalfe: -636.988411 hartree
dipole: -0.2090 -0.2501 0.0000
dipole: 0.3259
quadrupole: -34.6973 -25.8792 -30.7299
quadrupole: -1.4426 0.0000 0.0000
quadrupole: -4.2619 4.5563 -0.2944 -1.4426 0.0000 0.0000
hfenergy: -636.9950448 hartree
pointgroup: CS [SG(C2H2Cl1F1)]
dipole: -0.0835154 -0.0973062 0. debye
dipolederiv: -0.5486037 -0.0341721 0. -0.2004375 -0.133092 0. 0. 0. -0.0440542 -1.0511789 0.0008008 0. -0.2815501 -0.2485918 0. 0. 0. -0.140978 0.60606 0.1144933 0. 0.3700952 0.0662537 0. 0. 0. -0.2652152 0.9562817 -0.0046776 0. 0.216649 0.3163188 0. 0. 0. -0.0354568 -0.0053794 -0.0569224 0. -0.0567497 0.0139717 0. 0. 0. 0.2595887 0.0428204 -0.019522 0. -0.048007 -0.0148604 0. 0. 0. 0.2261155 unknown
polarizability: 49.2206445|-1.1378213|24.6002762|0.|0.|12.3524692 unknown
InChI: InChI=1S/C2H2ClF/c3-1-2-4/h1-2H
charge 0 multiplicity 1
6 atoms
Cl -2.121472 -0.167317 0.0000
F  1.928297 0.109196 0.0000
C  -0.426444 0.452565 0.0000
C  0.618304 -0.398885 0.0000
H  -0.335806 1.539601 0.0000
H  0.57632 -1.49196 0.0000
