program: Orca
programVersion: 5.0.2
elementType: Si F O O C C C C C C C C C C C C C C C C C C C C C C C C C H H H H H H H H H H H H H H H H H H H H H H H H H H H H H
charge: 0
multiplicity: 1
keywords: wb97x-d3
keywords: def2-TZVPP
keywords: def2/J RIJCOSX
keywords: DEFGRID2
keywords: scfconv7
keywords: smallprint printgap noloewdin
keywords: NOSOSCF
formula: C25H29FO2Si
InChI: InChI=1/C25H29FO2Si/c1-4-27-21-13-15-23(16-14-21)29(2,3)18-8-9-20-12-17-24(26)25(19-20)28-22-10-6-5-7-11-22/h5-7,10-17,19H,4,8-9,18H2,1-3H3
58 atoms
Si -2.652909 1.593604 -0.7637
F  1.582968 -4.681175 -0.693109
O  2.25556 2.55428 2.640978
O  1.949736 -2.024806 -0.651105
C  -2.965475 -0.248515 -1.091882
C  -3.546424 -1.088608 0.046875
C  -1.149441 1.927777 0.319247
C  -4.171725 2.331015 0.069705
C  -2.358358 2.40631 -2.437443
C  -2.575458 -1.404696 1.1911
C  0.141507 1.983985 -0.221644
C  -1.259171 2.11564 1.696033
C  -1.44025 -2.283397 0.747911
C  1.256497 2.198884 0.567358
C  -0.153439 2.327902 2.511353
C  1.118987 2.364121 1.946955
C  -0.249274 -1.730742 0.289192
C  -1.578896 -3.670052 0.732005
C  0.765762 -2.535885 -0.205381
C  -0.561029 -4.487405 0.264445
C  0.596395 -3.910414 -0.215785
C  2.192717 2.680414 4.055279
C  3.603586 2.805917 4.574151
C  1.928818 -1.065602 -1.626474
C  0.940734 -1.00619 -2.602041
C  2.977611 -0.156225 -1.626705
C  1.006987 -0.015808 -3.57265
C  3.033678 0.822641 -2.607343
C  2.046017 0.904543 -3.579904
H  -3.674277 -0.270096 -1.928609
H  -2.053824 -0.708751 -1.488618
H  -3.918773 -2.037572 -0.353062
H  -4.420678 -0.583852 0.468397
H  -4.359532 1.899723 1.055194
H  -4.074197 3.410731 0.201574
H  -5.067901 2.155474 -0.53035
H  -1.523392 1.947147 -2.972058
H  -3.237579 2.311733 -3.079001
H  -2.136949 3.471205 -2.340485
H  -2.184605 -0.479769 1.620228
H  -3.130659 -1.905926 1.987544
H  0.292756 1.855776 -1.288388
H  -2.233867 2.096965 2.17109
H  2.243744 2.238903 0.123076
H  -0.304737 2.464021 3.573836
H  -0.10767 -0.65607 0.310478
H  -2.492709 -4.124068 1.095549
H  -0.668876 -5.56463 0.259717
H  1.703677 1.803305 4.492532
H  1.603426 3.561122 4.332552
H  4.105629 3.683696 4.165741
H  3.582273 2.909714 5.659099
H  4.197665 1.92306 4.335681
H  0.128038 -1.721599 -2.61894
H  3.741206 -0.214094 -0.860954
H  0.237157 0.027814 -4.3325
H  3.851904 1.531369 -2.602121
H  2.088689 1.674043 -4.339328
elementType: Si F O C H
totalener: -1510.06913582 hartree
nucrepener: 2991.42960231 hartree
electener: -4501.49873812 hartree
oneelecener: -8013.19418656 hartree
twoeener: 3511.69544843 hartree
cpcmener: -0.02235564 hartree
kineticenergy: 1503.91833178 hartree
xcener: -135.236111628238 hartree
chargesum: 0.0000000
charge: 0.445102 -0.217319 -0.323043 -0.332761 -0.251363 -0.147000 -0.175668 -0.440594 -0.436389 -0.108831 -0.074071 -0.119200 -0.012959 -0.276997 -0.261997 0.344703 -0.157221 -0.172223 0.164394 -0.193776 0.218018 0.061535 -0.274011 0.307358 -0.169384 -0.282365 -0.186174 -0.109190 -0.163615 0.101107 0.065330 0.091487 0.083589 0.098637 0.112517 0.109339 0.095787 0.105189 0.105606 0.090927 0.095630 0.122810 0.146718 0.134145 0.135426 0.142050 0.141337 0.146749 0.092488 0.093232 0.087488 0.089055 0.086992 0.154518 0.144851 0.158909 0.157741 0.155384
qa: 0.4451 -0.2173 -0.3230 -0.3328 -0.2514 -0.1470 -0.1757 -0.4406 -0.4364 -0.1088 -0.0741 -0.1192 -0.0130 -0.2770 -0.2620 0.3447 -0.1572 -0.1722 0.1644 -0.1938 0.2180 0.0615 -0.2740 0.3074 -0.1694 -0.2824 -0.1862 -0.1092 -0.1636 0.1011 0.0653 0.0915 0.0836 0.0986 0.1125 0.1093 0.0958 0.1052 0.1056 0.0909 0.0956 0.1228 0.1467 0.1341 0.1354 0.1421 0.1413 0.1467 0.0925 0.0932 0.0875 0.0891 0.0870 0.1545 0.1449 0.1589 0.1577 0.1554
va: 4.1686 1.0698 2.0882 2.0833 3.8204 3.9070 3.6669 3.9216 3.9038 3.8236 3.8045 3.8186 3.6932 4.0037 3.9182 3.8157 3.8246 3.8830 3.7019 3.9014 4.0354 3.8008 3.9752 3.6398 3.8297 3.9495 3.8724 3.8432 3.8608 1.0084 1.0250 1.0007 1.0019 1.0067 1.0085 1.0064 1.0112 1.0108 1.0097 1.0152 1.0107 0.9798 0.9860 1.0171 1.0132 0.9939 1.0004 0.9990 0.9865 0.9858 1.0032 1.0057 1.0036 0.9979 1.0095 0.9921 0.9885 0.9910
dispcorr: -0.034813744 hartree
energy: -1510.103949560326
dipole: -17.97174 16.58979 -1.38195 25.39754 -24.61350 0.78404 7.70922 -6.84777 0.86145
magnitude: 1.80737 au
magnitude: 4.59396 debye
