program: Gaussian 09
title: 000068025
version: EM64L-G09RevD.01
frameworkgroup: C1[X(C4H7ClFNO)]
method: RPBEPBE
basis: SDD
operation: Freq
keyword: #p
keyword: freq=noraman
keyword: PBEPBE/SDD
title: #p freq=noraman PBEPBE/SDD
converged: YES YES NO NO
title: Mulliken charges:
elementType: Cl F O N C C C C H H H H H H H
charge: -0.068911 -0.246695 -0.269058 -0.341474 -0.319843 -0.554460 0.197364 -0.294504 0.263334 0.251140 0.348345 0.278832 0.270086 0.242504 0.243339
chargesum: 0.00000
title: Mulliken charges with hydrogens summed into heavy atoms:
elementType: Cl F O N C C C C
charge: -0.068911 -0.246695 -0.269058 0.006872 0.194630 -0.005541 0.197364 0.191339
polarizability: 7.52382567e+01 -7.55076911e+00 6.69977013e+01 4.56272692e+00 -2.54637543e+00 4.20177664e+01
1716.lowfreq: -13.2355 -8.7169 -6.2920 -0.0024 -0.0020 0.0017 29.2239 63.3756 98.6584
frequency: 28.8743 63.3748 98.6307 128.7816 184.2686 243.0614 327.2819 438.8393 469.2448 569.9644 584.5742 626.6470 708.0394 800.7823 920.3800 938.7234 987.6955 1000.5345 1033.8961 1122.3327 1166.8485 1175.4268 1224.4651 1257.6947 1301.6012 1335.6113 1366.6658 1437.3936 1441.3519 1451.2624 1509.0531 1624.3442 2998.2373 3036.7242 3055.1869 3068.7611 3111.4969 3155.3765 3523.5923
redmass: 5.5546 11.7132 3.6885 2.4589 8.9745 5.0540 2.5220 3.8830 5.1112 3.5475 4.3940 4.3364 1.1163 2.1363 3.0593 4.1995 2.4494 1.8903 1.6980 3.8097 1.2225 1.1303 1.3343 1.6466 1.1862 1.2815 1.3534 1.0772 1.1033 1.0841 2.1392 8.6370 1.0591 1.0561 1.0950 1.0647 1.1096 1.1119 1.0773
irintensity: 3.2178 2.0612 9.2919 17.7340 4.9676 16.7927 22.1027 3.4808 0.9897 10.3131 20.2362 13.5916 134.7681 21.1401 29.2353 27.5725 29.0040 1.3238 5.0434 9.1947 4.1724 0.8990 9.9876 57.3962 28.5639 14.9048 3.1534 19.1181 8.6879 30.2909 209.2991 231.7272 30.4276 14.6347 3.9599 20.9546 9.6518 12.4541 53.7515
temp: 298.150 k
press: 1.00000 atm
elementType: 17 9 8 7 6 6 6 6 1 1 1 1 1 1 1
symmnumber: 1
zpe: 296177.6 jmol-1
zpe.correction: 0.112808 hartree
zpe.thermalcorrener: 0.121765 hartree
zpe.thermalcorrenthalpy: 0.122709 hartree
zpe.thermalcorrgfe: 0.076665 hartree
zpe.sumelectzpe: -845.873135 hartree
zpe.sumelectthermal: -845.864178 hartree
zpe.sumelectthermalent: -845.863234 hartree
zpe.sumelectthermalfe: -845.909278 hartree
dipole: 0.4498 0.5619 0.1939
dipole: 0.7454
quadrupole: -54.9200 -61.2479 -51.7330
quadrupole: 9.5281 0.1767 1.0029
quadrupole: 1.0469 -5.2809 4.2339 9.5281 0.1767 1.0029
hfenergy: -845.9859428 hartree
pointgroup: C01 [X(C4H7Cl1F1N1O1)]
dipole: 0.2145864 -0.1805463 -0.0857777 debye
dipolederiv: -0.2955724 -0.0927409 -0.0929499 -0.1674183 -0.4344913 -0.1506728 -0.0990306 -0.0706673 -0.2692757 -0.3632869 -0.069395 -0.0236057 0.0786529 -0.7462921 -0.1006516 0.0146094 -0.1123402 -0.2889848 -0.7391639 -0.0251746 -0.0437002 -0.3780265 -0.9084546 -0.1595433 -0.1013776 -0.1279121 -0.4075842 -1.2361973 -0.2073165 -0.1624163 -0.0753461 -0.4510779 0.0065043 -0.1203915 0.0019609 -0.5157847 0.4354215 -0.0944589 -0.04568 -0.4364636 0.0131996 -0.1335503 -0.1200174 -0.0622485 0.1966437 0.2614029 0.2053021 0.0980282 0.2979294 0.5940668 0.1789575 0.1296155 0.1919643 0.2355056 1.4306933 0.2773497 0.1448001 0.5370487 0.991974 0.2381066 0.1598034 0.1948305 0.2239588 0.1739432 0.2164632 0.0430457 0.0862601 0.644137 0.0574971 0.0170457 0.0718595 0.3919623 0.1329996 -0.0893008 -0.0458954 0.0767017 0.0205393 -0.0003804 -0.0275676 -0.0461583 0.0921199 -0.0808706 0.0012422 0.0708764 0.0255604 0.0890626 0.1120512 0.088579 0.0467099 -0.0283018 0.241866 -0.0395746 0.0137005 0.006708 0.2192818 -0.035798 0.053722 -0.0470465 0.3472545 0.0414696 -0.0859217 0.0732962 -0.0791471 -0.0193851 0.0054774 0.0267961 0.0062165 -0.0360727 -0.0870347 0.0512283 -0.0174107 0.0457334 -0.0530936 -0.0384898 -0.0209512 -0.0623766 0.0836573 0.0380461 -0.0389773 0.0546101 -0.0349749 0.0160507 0.0144152 0.1069998 0.0193494 -0.0036779 0.0462837 -0.0087251 -0.0666989 0.0167819 0.0244829 0.0060766 -0.1078351 -0.0041416 -0.02142 unknown
polarizability: 73.3215045|6.7982121|66.2672671|7.1537386|7.9522995|44.6649528 unknown
InChI: InChI=1S/C4H7ClFNO/c5-1-2-7-4(8)3-6/h7H,1-3H2
charge 0 multiplicity 1
15 atoms
Cl 3.02818 1.072448 1.096989
F  -1.573521 2.062783 -0.072284
O  -1.208543 -1.476921 -0.891273
N  0.318982 0.252315 -0.463468
C  1.523611 -0.56391 -0.634035
C  2.368356 -0.648629 0.636298
C  -0.944158 -0.268847 -0.605896
C  -2.086392 0.728126 -0.399171
H  1.184594 -1.58149 -0.908159
H  2.137811 -0.170459 -1.465528
H  0.412839 1.240946 -0.211722
H  1.787504 -0.980535 1.508481
H  3.26367 -1.270638 0.490845
H  -2.725963 0.399713 0.437553
H  -2.679471 0.814497 -1.325632
