program: Gaussian 09
title: 000068024
version: EM64L-G09RevD.01
frameworkgroup: C1[X(C7H8FN)]
method: RPBEPBE
basis: SDD
operation: Freq
keyword: #pfreq=noraman
keyword: PBEPBE/SDD
title: #p freq=noraman PBEPBE/SDD
converged: YES YES NO NO
title: Mulliken charges:
elementType: F N C C C C C C C H H H H H H H H
charge: -0.219571 -0.419817 0.461972 -0.375974 -0.329125 -0.342920 -0.367721 0.302342 -0.635665 0.217400 0.239259 0.295488 0.247707 0.246113 0.229394 0.221805 0.229314
chargesum: 0.00000
title: Mulliken charges with hydrogens summed into heavy atoms:
elementType: F N C C C C C C C
charge: -0.219571 -0.124329 0.461972 -0.158574 -0.089866 -0.095213 -0.121609 0.302342 0.044847
polarizability: 1.18501652e+02 -1.41562146e-01 8.48973702e+01 -2.01115691e-02 1.16171274e-02 3.92913536e+01
1716.lowfreq: -13.5941 -7.5839 -0.0009 -0.0008 -0.0008 1.9638 84.3032 142.5031 185.9999
frequency: 84.2451 142.4836 185.9926 202.0021 322.1983 353.3670 353.5427 410.7334 415.4631 504.1469 519.1571 629.0374 699.8819 714.3346 789.5655 811.2118 813.5488 914.1118 927.2282 991.9167 1070.5604 1100.4402 1124.3776 1152.5873 1166.1616 1197.4726 1287.8157 1311.8824 1368.3480 1415.4955 1447.7323 1465.2349 1477.9985 1502.3147 1520.4148 1598.3027 1632.3583 2939.0338 2999.4463 3091.8507 3124.6273 3154.3394 3170.1437 3175.8615 3597.7567
redmass: 3.5705 1.9959 1.5550 3.4486 1.1749 4.7531 6.0982 5.8845 3.0623 2.4033 4.0559 7.1017 3.3008 4.7652 1.2531 1.7822 5.5820 1.3476 1.3322 2.8806 2.3652 1.4107 1.2770 1.4707 1.7215 1.8871 1.3485 2.1539 4.2015 3.7867 1.2192 1.0414 1.6363 1.1424 2.6814 6.0634 6.5465 1.0379 1.1010 1.0953 1.0893 1.0874 1.0953 1.0968 1.0776
irintensity: 3.9733 6.9471 0.3379 0.0289 94.3519 18.5475 1.0991 4.9405 0.3948 23.0855 1.6210 0.1475 0.8938 40.4234 0.1750 108.8832 7.2045 0.5155 0.0052 2.2407 9.8482 10.9393 1.7134 14.0962 11.1668 77.2459 1.0288 14.0460 28.3093 7.7851 11.0063 12.6370 4.2189 0.0214 373.1058 0.0099 69.9137 94.3585 57.5167 25.6669 17.9650 11.2568 9.5888 3.3091 34.7886
temp: 298.150 k
press: 1.00000 atm
elementType: 9 7 6 6 6 6 6 6 6 1 1 1 1 1 1 1 1
symmnumber: 1
zpe: 352161.0 jmol-1
zpe.correction: 0.134131 hartree
zpe.thermalcorrener: 0.142595 hartree
zpe.thermalcorrenthalpy: 0.143539 hartree
zpe.thermalcorrgfe: 0.101043 hartree
zpe.sumelectzpe: -425.470268 hartree
zpe.sumelectthermal: -425.461804 hartree
zpe.sumelectthermalent: -425.460860 hartree
zpe.sumelectthermalfe: -425.503356 hartree
dipole: 4.4774 0.7692 0.0029
dipole: 4.5430
quadrupole: -50.9677 -44.5708 -56.9050
quadrupole: -0.0729 0.0092 0.0031
quadrupole: -0.1532 6.2437 -6.0905 -0.0729 0.0092 0.0031
hfenergy: -425.6043988 hartree
pointgroup: C01 [X(C7H8F1N1)]
dipole: -1.7638663 0.2835427 -0.0543192 debye
dipolederiv: -1.1945554 0.1073641 -0.0333909 0.1358316 -0.2215256 0.0021963 -0.0324076 0.001147 -0.1473933 -1.5344905 -0.0766155 -0.0387764 0.1192525 -0.251399 0.013621 -0.0301121 0.0058126 -0.5187872 1.541236 -0.1249601 0.0450408 -0.3636763 -0.1429219 -0.0233956 0.0360632 -0.0145231 0.1403571 -0.3342057 0.1690573 0.0021598 -0.3076473 0.1007726 0.0006575 -0.0149635 0.0176859 -0.2302793 -0.2650128 -0.152009 -0.0059938 0.4368797 0.0451534 0.0258313 0.0150931 0.0045617 -0.2508296 0.0116764 -0.169476 -0.0008911 0.1061919 0.0992673 0.0118751 0.0087283 0.0020275 -0.1339066 0.0310184 0.2073492 0.013037 -0.1151269 0.0751245 0.0032746 0.0017958 0.0147595 -0.1341394 1.0968827 -0.1499909 0.0330177 -0.1468129 0.0030346 -0.0057152 0.0333105 -0.005672 0.0180054 0.4258266 0.1580296 0.0100874 0.4244755 0.3992879 0.0189602 0.0191359 0.0093487 0.3094867 0.0217286 0.1018432 -0.001548 0.0739338 -0.0839686 -0.00608 -0.0025497 -0.0050586 0.1663197 0.0063691 -0.0977472 -0.0090956 -0.0976267 -0.0186729 -0.0100067 -0.0090276 -0.0098144 0.1697117 0.1306528 -0.0509131 -0.0093904 -0.0783861 0.0847916 -0.0119051 -0.0104732 -0.0105382 0.3345377 0.0273463 -0.08166 -0.0081409 -0.0890695 0.0059313 -0.0091152 -0.0083356 -0.0088954 0.1771286 0.0685992 0.0584398 -0.0017699 0.0734965 -0.0345734 -0.0047614 -0.0013287 -0.0053787 0.1764451 0.0567905 0.0301512 0.0560669 -0.1432256 -0.0444357 -0.1183692 -0.0455649 -0.1254759 -0.1105587 -0.1468717 0.0471343 -0.0084333 0.1266196 0.0468912 0.001742 -0.0055397 -0.0011548 0.1265368 0.0570092 0.0240031 -0.0419791 -0.1551099 -0.0627572 0.1111906 0.0461758 0.1311682 -0.0926348 unknown
polarizability: 118.3935343|0.4458364|84.8485539|2.8281938|1.6106273|39.4482875 unknown
InChI: InChI=1S/C7H8FN/c1-9-7-4-2-6(8)3-5-7/h2-5,9H,1H3
charge 0 multiplicity 1
17 atoms
F  3.214375 -0.305661 0.077807
N  -2.360275 0.494862 -0.091031
C  -0.980694 0.2784 -0.049917
C  -0.086907 1.391793 0.020316
C  -0.428163 -1.03765 -0.07629
C  1.307027 1.20106 0.062847
C  0.969896 -1.231702 -0.033789
C  1.811905 -0.1117 0.034886
C  -3.345815 -0.578191 -0.168125
H  -0.491601 2.411156 0.041506
H  -1.084149 -1.911195 -0.129414
H  -2.690695 1.456921 -0.068383
H  1.993918 2.051045 0.116569
H  1.399893 -2.237773 -0.053751
H  -3.221402 -1.191622 -1.084497
H  -4.357969 -0.141583 -0.189836
H  -3.289043 -1.258759 0.706603
