program: Gaussian 09
title: 000068023
version: EM64L-G09RevD.01
frameworkgroup: C1[X(C7H5FO)]
method: RPBEPBE
basis: SDD
operation: Freq
keyword: #pfreq=noraman
keyword: PBEPBE/SDD
title: #p freq=noraman PBEPBE/SDD
converged: YES YES YES YES
title: Mulliken charges:
elementType: F O C C C C C C C H H H H H
charge: -0.192178 -0.203714 0.387398 -0.331469 -0.317696 -0.349074 -0.347407 0.332081 -0.196475 0.242364 0.279250 0.263922 0.264819 0.168180
chargesum: 0.00000
title: Mulliken charges with hydrogens summed into heavy atoms:
elementType: F O C C C C C C C
charge: -0.192178 -0.203714 0.387398 -0.089105 -0.038447 -0.085152 -0.082589 0.332081 -0.028296
polarizability: 1.15866625e+02 1.74729370e+00 8.07992045e+01 -4.35963930e-03 4.23213214e-03 3.04774845e+01
1716.lowfreq: -12.2969 -8.5884 -0.0011 -0.0011 -0.0009 10.2408 98.6682 188.8030 191.0427
frequency: 98.6616 188.8010 191.0426 329.3014 365.7702 403.1168 418.0552 502.7859 584.9131 624.7390 716.4516 752.5365 822.8573 834.6571 841.0478 948.0644 979.2515 1000.4950 1002.1175 1102.7120 1153.9892 1193.0701 1218.7051 1287.6756 1364.3716 1407.7440 1413.4552 1490.2607 1584.1114 1605.6245 1625.4322 2875.7516 3133.4263 3155.2844 3179.1459 3181.3403
redmass: 9.6445 3.2845 7.9569 3.7970 8.8069 6.4402 2.9148 2.6723 7.3473 7.2363 3.5133 5.4831 1.2903 5.6424 1.4311 1.3636 1.4021 1.6911 2.7053 1.2940 1.3062 2.1469 4.3667 1.2876 2.1157 2.8060 2.7789 2.6789 8.3238 6.2502 7.0523 1.0851 1.0901 1.0894 1.0959 1.0966
irintensity: 6.3693 5.0465 9.4596 6.1948 2.0143 5.2765 0.7069 22.9646 29.4368 1.5500 0.0107 1.9674 21.0143 37.6775 68.0642 1.7473 0.7102 7.1804 4.9515 12.6391 57.8952 1.8676 139.7938 9.2160 4.8684 9.8907 18.5322 38.8135 126.0243 154.9536 79.1486 116.7952 6.8044 0.2391 2.0050 3.6034
temp: 298.150 k
press: 1.00000 atm
elementType: 9 8 6 6 6 6 6 6 6 1 1 1 1 1
symmnumber: 1
zpe: 260646.9 jmol-1
zpe.correction: 0.099275 hartree
zpe.thermalcorrener: 0.106556 hartree
zpe.thermalcorrenthalpy: 0.107500 hartree
zpe.thermalcorrgfe: 0.067257 hartree
zpe.sumelectzpe: -444.166127 hartree
zpe.sumelectthermal: -444.158846 hartree
zpe.sumelectthermalent: -444.157902 hartree
zpe.sumelectthermalfe: -444.198145 hartree
dipole: 1.5339 1.7988 0.0006
dipole: 2.3640
quadrupole: -67.1826 -42.4145 -52.9642
quadrupole: -4.5619 -0.0013 0.0001
quadrupole: -12.9955 11.7726 1.2229 -4.5619 -0.0013 0.0001
hfenergy: -444.2654019 hartree
pointgroup: C01 [X(C7H5F1O1)]
dipole: 0.6084473 0.7034296 0.0002491 debye
dipolederiv: -1.2168829 0.1073522 0.0001224 0.1192448 -0.2236551 -0.0000172 0.0001478 -0.0000184 -0.1476085 -1.0601481 -0.1069021 0.0001122 -0.461395 -0.5170084 0.0001134 -0.0002725 -0.000122 -0.3336317 -0.8464569 0.052692 0.0000238 0.1956491 -0.1876005 0.0000028 0.000089 0.0000066 0.003487 0.2845856 -0.0682821 -0.0000706 0.1122829 0.0979874 0.0000016 0.0000613 0.0000185 -0.1395642 0.1982379 0.0477514 -0.000051 -0.1512315 0.0796402 0.0000049 0.0000261 -0.0000073 -0.0928276 -0.2885336 0.1304884 0.0000268 0.3370002 -0.1172429 -0.0000419 0.0000223 -0.0000251 -0.1562537 -0.3717706 -0.0921583 0.0000203 -0.2613791 -0.0227549 0.0000458 0.0000065 0.0000287 -0.1575557 1.3716184 -0.1069611 -0.0001492 -0.1135282 0.3940055 0.0000318 -0.0001622 0.0000297 0.1173325 1.684947 0.0197048 -0.0000614 0.0608967 0.7385171 -0.0001498 0.0001418 -0.0000492 0.1144369 0.063014 0.0897347 0.0000143 0.0507809 -0.0399286 -0.0000199 0.0000183 -0.0000166 0.1585695 0.0799741 -0.074442 0.0000097 -0.0293001 0.0344865 0.0000042 0.0000118 0.0000003 0.1571565 0.0338808 -0.0659373 0.0000082 -0.0721583 0.0267409 0.0000008 -0.0000004 0.0000087 0.1855742 0.0610085 0.0556191 0.0000124 0.0612358 -0.0002423 -0.0000185 0.0000026 -0.0000233 0.1828581 0.0065259 0.0113402 -0.0000179 0.1519018 -0.2629449 0.0000419 -0.0000923 0.0001694 0.1080267 unknown
polarizability: 115.8894784|1.5003685|80.7763512|-0.0043298|0.0042627|30.4774845 unknown
InChI: InChI=1S/C7H5FO/c8-7-3-1-6(5-9)2-4-7/h1-5H
charge 0 multiplicity 1
14 atoms
F  3.184251 -0.269308 -0.000235
O  -3.293012 -0.522486 -0.000095
C  -0.978671 0.225101 0.000303
C  -0.126797 1.361564 0.000263
C  -0.416562 -1.08174 0.000156
C  1.274185 1.207177 0.000093
C  0.978783 -1.255323 -0.000016
C  1.79015 -0.10199 -0.000048
C  -2.450419 0.414271 0.000502
H  -0.563376 2.36757 0.000385
H  -1.095179 -1.941229 0.000196
H  1.954399 2.063171 0.000065
H  1.441141 -2.246334 -0.000132
H  -2.784893 1.483057 -0.000037
