program: Orca
programVersion: 5.0.2
elementType: Si F O O C C C C C C C C C C C C C C C C C C C C C C C C C H H H H H H H H H H H H H H H H H H H H H H H H H H H H H
charge: 0
multiplicity: 1
keywords: wb97x-d3
keywords: def2-TZVPP
keywords: def2/J RIJCOSX
keywords: DEFGRID2
keywords: scfconv7
keywords: smallprint printgap noloewdin
keywords: NOSOSCF
formula: C25H29FO2Si
InChI: InChI=1/C25H29FO2Si/c1-4-27-21-13-15-23(16-14-21)29(2,3)18-8-9-20-12-17-24(26)25(19-20)28-22-10-6-5-7-11-22/h5-7,10-17,19H,4,8-9,18H2,1-3H3
58 atoms
Si -3.97583 1.430803 0.889688
F  2.053179 -3.88003 -1.498749
O  2.022187 2.23479 0.787897
O  1.765771 -1.183798 -1.779791
C  -4.27903 -0.388473 1.365723
C  -3.163439 -1.366114 0.999699
C  -2.121308 1.747856 0.821478
C  -4.756236 2.521865 2.212829
C  -4.748766 1.845605 -0.777037
C  -2.938228 -1.50339 -0.508292
C  -1.302712 1.435504 1.914885
C  -1.484302 2.258345 -0.307199
C  -1.625893 -2.163286 -0.816082
C  0.067373 1.609994 1.878699
C  -0.107211 2.451678 -0.366321
C  0.682665 2.120229 0.731822
C  -0.519745 -1.380607 -1.137997
C  -1.461122 -3.541833 -0.722993
C  0.714175 -1.956958 -1.378132
C  -0.224086 -4.131992 -0.94625
C  0.8511 -3.333327 -1.271328
C  2.749499 2.732281 -0.328447
C  2.726085 4.243462 -0.416982
C  2.815439 -0.986783 -0.925571
C  4.014249 -0.591559 -1.507279
C  2.708762 -1.128099 0.451233
C  5.112909 -0.338177 -0.702097
C  3.819845 -0.868862 1.243965
C  5.023865 -0.477065 0.677648
H  -4.445036 -0.427248 2.447487
H  -5.22602 -0.71128 0.917449
H  -3.378734 -2.356389 1.413548
H  -2.230438 -1.045868 1.469715
H  -4.655315 3.582263 1.971975
H  -5.82335 2.312432 2.321493
H  -4.29521 2.363722 3.190325
H  -5.825255 1.659157 -0.750828
H  -4.614834 2.897986 -1.037155
H  -4.342523 1.249574 -1.59645
H  -3.764441 -2.066194 -0.951143
H  -2.949356 -0.519293 -0.982498
H  -1.738611 1.036403 2.825142
H  -2.063503 2.519662 -1.185837
H  0.675848 1.350519 2.736965
H  0.322065 2.853224 -1.274393
H  -0.616908 -0.303238 -1.214545
H  -2.3073 -4.171556 -0.47674
H  -0.097362 -5.204965 -0.877351
H  2.399024 2.272447 -1.25721
H  3.771871 2.388168 -0.170837
H  3.356731 4.565152 -1.247026
H  1.726044 4.642134 -0.589583
H  3.120418 4.695332 0.493916
H  4.081311 -0.485959 -2.583068
H  1.77488 -1.421538 0.914456
H  6.045913 -0.034359 -1.159355
H  3.735187 -0.975586 2.317838
H  5.884395 -0.280806 1.303407
elementType: Si F O C H
totalener: -1510.06727384 hartree
nucrepener: 2987.96093313 hartree
electener: -4498.02820697 hartree
oneelecener: -8006.62331850 hartree
twoeener: 3508.59511153 hartree
cpcmener: -0.02299982 hartree
kineticenergy: 1503.91790066 hartree
xcener: -135.233315100075 hartree
chargesum: 0.0000000
charge: 0.481706 -0.218011 -0.329541 -0.327143 -0.289422 -0.145484 -0.130522 -0.446476 -0.434419 -0.060269 -0.134109 -0.164451 -0.017884 -0.286176 -0.217959 0.334366 -0.206053 -0.169357 0.123644 -0.193659 0.281390 0.035320 -0.266430 0.312053 -0.248407 -0.193424 -0.139218 -0.161641 -0.170075 0.100387 0.084920 0.094801 0.084473 0.099272 0.100860 0.099508 0.109781 0.105900 0.107502 0.099864 0.068790 0.139371 0.142468 0.132572 0.136233 0.153698 0.143872 0.146894 0.089190 0.108503 0.094556 0.091718 0.089540 0.141577 0.148284 0.154270 0.156299 0.156547
qa: 0.4817 -0.2180 -0.3295 -0.3271 -0.2894 -0.1455 -0.1305 -0.4465 -0.4344 -0.0603 -0.1341 -0.1645 -0.0179 -0.2862 -0.2180 0.3344 -0.2061 -0.1694 0.1236 -0.1937 0.2814 0.0353 -0.2664 0.3121 -0.2484 -0.1934 -0.1392 -0.1616 -0.1701 0.1004 0.0849 0.0948 0.0845 0.0993 0.1009 0.0995 0.1098 0.1059 0.1075 0.0999 0.0688 0.1394 0.1425 0.1326 0.1362 0.1537 0.1439 0.1469 0.0892 0.1085 0.0946 0.0917 0.0895 0.1416 0.1483 0.1543 0.1563 0.1565
va: 4.0898 1.0680 2.0451 2.0605 3.8660 3.8593 3.6892 3.9008 3.8981 3.7653 3.8633 3.8440 3.7151 4.0135 3.8617 3.6917 3.9036 3.9062 3.8137 3.9332 3.9673 3.8442 3.9665 3.5609 3.9574 3.8416 3.8751 3.9007 3.8746 1.0066 1.0118 1.0092 1.0091 1.0115 1.0100 1.0115 1.0110 1.0075 1.0075 1.0096 1.0215 0.9880 0.9901 1.0139 1.0072 1.0066 1.0001 0.9998 0.9877 0.9893 1.0073 1.0026 1.0044 1.0108 1.0066 0.9909 0.9912 0.9902
dispcorr: -0.034870450 hartree
energy: -1510.102144288804
dipole: -21.57751 20.83626 -0.74125 23.32450 -22.88376 0.44073 8.51078 -8.45669 0.05409
magnitude: 0.86408 au
magnitude: 2.19630 debye
