program: Orca
programVersion: 5.0.2
elementType: Cl Cl F F F F O O C C C C C C C C C C C C C C C H H H H H H H H H H H H
charge: 0
multiplicity: 1
keywords: wb97x-d3
keywords: def2-TZVPP
keywords: def2/J RIJCOSX
keywords: DEFGRID2
keywords: scfconv7
keywords: smallprint printgap noloewdin
keywords: NOSOSCF
formula: C15H12Cl2F4O2
InChI: InChI=1/C15H12Cl2F4O2/c1-15(2)7(3-10(16)17)11(15)14(22)23-5-6-12(20)8(18)4-9(19)13(6)21/h3-4,7,11H,5H2,1-2H3
35 atoms
Cl -3.856686 1.015615 1.946707
Cl -6.203423 0.377129 0.394054
F  2.424322 -1.202674 -1.688949
F  2.792885 2.56429 1.100019
F  4.682931 1.32682 2.52002
F  4.29195 -2.454503 -0.234433
O  0.276126 0.735738 -1.005574
O  0.06909 0.226514 -3.178246
C  -1.574284 -1.721282 -0.64074
C  -1.538739 -0.60894 -1.670553
C  -2.275911 -0.421743 -0.359738
C  -0.362859 -2.061056 0.193165
C  -2.379378 -2.941393 -1.018725
C  -3.739842 -0.310003 -0.399038
C  -0.325716 0.14931 -2.037943
C  -4.48847 0.279051 0.524611
C  1.526522 1.403434 -1.188858
C  2.566056 0.721651 -0.349136
C  2.973109 -0.569052 -0.650825
C  3.156515 1.333144 0.743818
C  4.12956 0.689341 1.48819
C  3.932439 -1.216617 0.099721
C  4.525845 -0.591911 1.177215
H  -2.162978 -0.793583 -2.537825
H  -1.78034 0.205676 0.371249
H  0.153427 -1.188789 0.586344
H  -0.675178 -2.664211 1.047306
H  0.349252 -2.654713 -0.381883
H  -1.740734 -3.670841 -1.519381
H  -2.78846 -3.418214 -0.1262
H  -3.207531 -2.718194 -1.689802
H  -4.258465 -0.737604 -1.249022
H  1.386618 2.436968 -0.88141
H  1.825664 1.410481 -2.236195
H  5.282863 -1.097104 1.762973
elementType: Cl F O C H
totalener: -2049.15390945 hartree
nucrepener: 2252.87141432 hartree
electener: -4302.02532377 hartree
oneelecener: -7301.49441226 hartree
twoeener: 2999.46908849 hartree
cpcmener: -0.02588282 hartree
kineticenergy: 2043.54526453 hartree
xcener: -143.167470207218 hartree
chargesum: 0.0000000
charge: -0.058415 -0.061898 -0.203861 -0.203199 -0.203862 -0.203556 -0.272014 -0.482523 0.093519 -0.110573 0.060355 -0.278393 -0.263863 -0.220341 0.431019 0.040353 0.043267 -0.117154 0.222425 0.231709 0.198988 0.214367 -0.168057 0.098258 0.086067 0.089618 0.103438 0.099727 0.099389 0.099556 0.091823 0.134895 0.116463 0.135988 0.156486
qa: -0.0584 -0.0619 -0.2039 -0.2032 -0.2039 -0.2036 -0.2720 -0.4825 0.0935 -0.1106 0.0604 -0.2784 -0.2639 -0.2203 0.4310 0.0404 0.0433 -0.1172 0.2224 0.2317 0.1990 0.2144 -0.1681 0.0983 0.0861 0.0896 0.1034 0.0997 0.0994 0.0996 0.0918 0.1349 0.1165 0.1360 0.1565
va: 1.2672 1.2437 1.0947 1.0984 1.0841 1.0862 2.1183 2.0178 3.7190 3.8598 3.8226 3.9017 3.9065 3.8812 4.1697 4.2084 3.8371 3.5984 3.8352 3.9225 3.9530 3.9794 3.8676 1.0306 1.0423 1.0127 1.0020 1.0044 1.0009 1.0015 1.0053 1.0162 1.0120 1.0187 0.9971
dispcorr: -0.018256633 hartree
energy: -2049.172166087721
dipole: -6.58041 7.20581 0.62540 -15.82702 15.14789 -0.67914 -11.10371 11.72252 0.61881
magnitude: 1.11143 au
magnitude: 2.82503 debye
