program: Orca
programVersion: 5.0.2
elementType: Cl Cl F F F F O O C C C C C C C C C C C C C C C H H H H H H H H H H H H
charge: 0
multiplicity: 1
keywords: wb97x-d3
keywords: def2-TZVPP
keywords: def2/J RIJCOSX
keywords: DEFGRID2
keywords: scfconv7
keywords: smallprint printgap noloewdin
keywords: NOSOSCF
formula: C15H12Cl2F4O2
InChI: InChI=1/C15H12Cl2F4O2/c1-15(2)7(3-10(16)17)11(15)14(22)23-5-6-12(20)8(18)4-9(19)13(6)21/h3-4,7,11H,5H2,1-2H3
35 atoms
Cl -1.644213 -0.485793 1.820335
Cl -4.333549 0.140485 2.665351
F  3.856124 1.646441 -1.923128
F  1.302631 -1.17796 0.837029
F  2.542449 -0.185248 2.99371
F  5.111087 2.606509 0.225367
O  0.43152 -0.014467 -1.684755
O  -0.232957 -2.152675 -1.833015
C  -3.049463 -0.829457 -2.281029
C  -1.833487 -0.414223 -1.462576
C  -2.908806 -1.300576 -0.875579
C  -2.923709 -1.82576 -3.405131
C  -4.026092 0.28305 -2.57631
C  -3.768493 -0.784832 0.21254
C  -0.491684 -0.981917 -1.681049
C  -3.309969 -0.421003 1.401266
C  1.81508 -0.356899 -1.790751
C  2.536723 0.208168 -0.603397
C  3.516696 1.17905 -0.721622
C  2.233154 -0.235524 0.675276
C  2.875438 0.270468 1.786774
C  4.169464 1.678087 0.392033
C  3.854995 1.233513 1.657098
H  -1.837282 0.621586 -1.144175
H  -2.623028 -2.343295 -0.76069
H  -3.913845 -2.202195 -3.667397
H  -2.505275 -1.354563 -4.2960
H  -2.306508 -2.684666 -3.153312
H  -3.742067 0.808966 -3.489012
H  -5.02884 -0.121477 -2.726103
H  -4.078373 1.018913 -1.773176
H  -4.837257 -0.724549 0.041823
H  2.189312 0.068246 -2.719337
H  1.956902 -1.435651 -1.842414
H  4.363566 1.628983 2.526781
elementType: Cl F O C H
totalener: -2049.15326859 hartree
nucrepener: 2298.73131603 hartree
electener: -4347.88458462 hartree
oneelecener: -7394.36205560 hartree
twoeener: 3046.47747098 hartree
cpcmener: -0.02351045 hartree
kineticenergy: 2043.55326476 hartree
xcener: -143.167279776786 hartree
chargesum: 0.0000000
charge: -0.056579 -0.059723 -0.203621 -0.205041 -0.203284 -0.203791 -0.282170 -0.484381 0.134677 -0.146965 -0.025257 -0.275586 -0.278742 -0.227414 0.423174 0.086766 0.076756 -0.118345 0.226251 0.231827 0.199233 0.202281 -0.167046 0.116714 0.109253 0.096897 0.101511 0.092833 0.100308 0.102275 0.094594 0.140912 0.115730 0.129796 0.156155
qa: -0.0566 -0.0597 -0.2036 -0.2050 -0.2033 -0.2038 -0.2822 -0.4844 0.1347 -0.1470 -0.0253 -0.2756 -0.2787 -0.2274 0.4232 0.0868 0.0768 -0.1183 0.2263 0.2318 0.1992 0.2023 -0.1670 0.1167 0.1093 0.0969 0.1015 0.0928 0.1003 0.1023 0.0946 0.1409 0.1157 0.1298 0.1562
va: 1.2897 1.2463 1.0971 1.0963 1.0857 1.0844 2.1176 2.0189 3.7045 3.8303 3.8686 3.8947 3.9151 3.9138 4.1474 4.1781 3.8094 3.6285 3.9157 3.8596 3.9873 3.9560 3.8646 1.0253 1.0251 1.0012 0.9984 1.0184 1.0024 0.9994 0.9985 1.0090 1.0101 1.0202 0.9974
dispcorr: -0.018089743 hartree
energy: -2049.171358335073
dipole: -24.77704 24.32462 -0.45242 -8.20212 8.91937 0.71725 -29.74488 28.87586 -0.86902
magnitude: 1.21422 au
magnitude: 3.08630 debye
