program: Orca
programVersion: 5.0.2
elementType: Cl Cl F F F F O O C C C C C C C C C C C C C C C H H H H H H H H H H H H
charge: 0
multiplicity: 1
keywords: wb97x-d3
keywords: def2-TZVPP
keywords: def2/J RIJCOSX
keywords: DEFGRID2
keywords: scfconv7
keywords: smallprint printgap noloewdin
keywords: NOSOSCF
formula: C15H12Cl2F4O2
InChI: InChI=1/C15H12Cl2F4O2/c1-15(2)7(3-10(16)17)11(15)14(22)23-5-6-12(20)8(18)4-9(19)13(6)21/h3-4,7,11H,5H2,1-2H3
35 atoms
Cl -1.281905 1.805467 -0.056277
Cl -3.976613 2.845617 0.0093
F  1.098042 0.39931 2.052899
F  3.588307 -1.773096 -1.29868
F  4.870697 0.50345 -1.815406
F  2.361205 2.688719 1.502702
O  0.165255 -1.852385 0.572699
O  0.386819 -1.789604 -1.646609
C  -2.860548 -2.252509 -0.1246
C  -1.750775 -1.39483 -0.716604
C  -2.53317 -0.934432 0.490769
C  -2.53693 -3.514224 0.634999
C  -4.09938 -2.370252 -0.978049
C  -3.419163 0.243366 0.360522
C  -0.310027 -1.703212 -0.660094
C  -2.958637 1.465058 0.133667
C  1.57268 -2.023939 0.729335
C  2.30745 -0.756049 0.399788
C  2.020144 0.412326 1.09024
C  3.273384 -0.688746 -0.590066
C  3.938165 0.493356 -0.862662
C  2.674488 1.594821 0.807864
C  3.644562 1.648514 -0.171644
H  -2.015351 -0.929038 -1.659445
H  -2.001221 -0.98153 1.437003
H  -2.285689 -4.324589 -0.05115
H  -1.713621 -3.396755 1.336251
H  -3.40973 -3.829827 1.209107
H  -4.973802 -2.568772 -0.355784
H  -4.29742 -1.4662 -1.554464
H  -4.000929 -3.196709 -1.683298
H  -4.488846 0.114527 0.481554
H  1.933024 -2.864321 0.138154
H  1.710477 -2.279466 1.778411
H  4.162963 2.572875 -0.391474
elementType: Cl F O C H
totalener: -2049.15226707 hartree
nucrepener: 2357.89842512 hartree
electener: -4407.05069219 hartree
oneelecener: -7512.82957047 hartree
twoeener: 3105.77887828 hartree
cpcmener: -0.02684113 hartree
kineticenergy: 2043.55775996 hartree
xcener: -143.168707192848 hartree
chargesum: -0.0000000
charge: -0.059470 -0.058359 -0.200709 -0.204820 -0.204689 -0.204596 -0.269624 -0.485348 0.130326 -0.151150 0.004861 -0.269944 -0.283621 -0.246166 0.426118 0.091280 0.052800 -0.115838 0.164417 0.266710 0.193731 0.210605 -0.164916 0.116044 0.112784 0.102523 0.093926 0.096311 0.102200 0.093969 0.099811 0.142402 0.124913 0.137579 0.155939
qa: -0.0595 -0.0584 -0.2007 -0.2048 -0.2047 -0.2046 -0.2696 -0.4853 0.1303 -0.1511 0.0049 -0.2699 -0.2836 -0.2462 0.4261 0.0913 0.0528 -0.1158 0.1644 0.2667 0.1937 0.2106 -0.1649 0.1160 0.1128 0.1025 0.0939 0.0963 0.1022 0.0940 0.0998 0.1424 0.1249 0.1376 0.1559
va: 1.2825 1.2483 1.0920 1.0932 1.0836 1.0833 2.1126 2.0210 3.7337 3.8521 3.8199 3.8952 3.9142 3.9104 4.1171 4.1672 3.8415 3.5616 3.9137 3.8832 3.9553 3.9468 3.8679 1.0211 1.0215 0.9990 1.0128 1.0013 0.9995 0.9993 1.0023 1.0079 1.0157 0.9969 0.9974
dispcorr: -0.019625065 hartree
energy: -2049.171892131833
dipole: -24.23022 23.33535 -0.89487 -29.70474 28.69463 -1.01011 0.32338 0.97414 1.29753
magnitude: 1.87208 au
magnitude: 4.75845 debye
