program: Orca
programVersion: 5.0.2
elementType: Cl Cl F F F F O O C C C C C C C C C C C C C C C H H H H H H H H H H H H
charge: 0
multiplicity: 1
keywords: wb97x-d3
keywords: def2-TZVPP
keywords: def2/J RIJCOSX
keywords: DEFGRID2
keywords: scfconv7
keywords: smallprint printgap noloewdin
keywords: NOSOSCF
formula: C15H12Cl2F4O2
InChI: InChI=1/C15H12Cl2F4O2/c1-15(2)7(3-10(16)17)11(15)14(22)23-5-6-12(20)8(18)4-9(19)13(6)21/h3-4,7,11H,5H2,1-2H3
35 atoms
Cl -1.412084 0.189662 1.721691
Cl -4.059432 -0.45076 2.67966
F  3.585342 1.690389 -1.677905
F  1.139611 -1.670726 0.527389
F  2.117721 -0.837796 2.871586
F  4.646525 2.437017 0.656883
O  0.351227 -0.602072 -1.916741
O  0.124837 1.615039 -1.832877
C  -2.693912 -0.681509 -2.358622
C  -1.804409 0.271913 -1.57234
C  -2.310804 -1.017032 -0.959269
C  -2.147013 -1.51717 -3.489682
C  -4.087177 -0.163595 -2.62206
C  -3.26943 -0.960625 0.165965
C  -0.367919 0.509942 -1.79524
C  -2.957371 -0.475345 1.35902
C  1.769974 -0.485176 -1.959535
C  2.329152 -0.013207 -0.6461
C  3.223111 1.041483 -0.570651
C  1.98101 -0.63767 0.543006
C  2.49389 -0.215771 1.754167
C  3.763789 1.438563 0.638849
C  3.398726 0.822631 1.815485
H  -2.308451 1.176776 -1.252436
H  -1.566513 -1.80199 -0.859063
H  -2.867641 -2.296688 -3.742725
H  -1.993389 -0.910894 -4.383762
H  -1.209224 -2.01139 -3.248913
H  -4.785722 -0.994027 -2.739319
H  -4.456313 0.472913 -1.817507
H  -4.109929 0.420765 -3.543073
H  -4.26446 -1.367671 0.025859
H  2.081976 0.159441 -2.779878
H  2.128119 -1.489718 -2.178817
H  3.81253 1.143191 2.762709
elementType: Cl F O C H
totalener: -2049.15133933 hartree
nucrepener: 2366.41795041 hartree
electener: -4415.56928974 hartree
oneelecener: -7529.87339392 hartree
twoeener: 3114.30410418 hartree
cpcmener: -0.02648497 hartree
kineticenergy: 2043.56590438 hartree
xcener: -143.170660097220 hartree
chargesum: 0.0000000
charge: -0.058625 -0.058364 -0.204350 -0.197727 -0.204189 -0.204386 -0.271517 -0.483626 0.139427 -0.133023 -0.007020 -0.271601 -0.283495 -0.247419 0.410906 0.094547 0.057238 -0.096673 0.250104 0.155248 0.210837 0.196855 -0.166888 0.112167 0.113575 0.095264 0.102603 0.094225 0.102110 0.093999 0.100360 0.142408 0.126435 0.134825 0.155769
qa: -0.0586 -0.0584 -0.2044 -0.1977 -0.2042 -0.2044 -0.2715 -0.4836 0.1394 -0.1330 -0.0070 -0.2716 -0.2835 -0.2474 0.4109 0.0945 0.0572 -0.0967 0.2501 0.1552 0.2108 0.1969 -0.1669 0.1122 0.1136 0.0953 0.1026 0.0942 0.1021 0.0940 0.1004 0.1424 0.1264 0.1348 0.1558
va: 1.2829 1.2482 1.0941 1.0942 1.0835 1.0835 2.1091 2.0198 3.7186 3.8611 3.8257 3.8965 3.9179 3.9132 4.1193 4.1651 3.8450 3.5383 3.9059 3.9245 3.9424 3.9532 3.8708 1.0219 1.0222 1.0009 0.9992 1.0128 0.9994 0.9995 1.0021 1.0086 1.0151 0.9964 0.9974
dispcorr: -0.019879057 hartree
energy: -2049.171218388724
dipole: -21.67884 21.12950 -0.54934 -8.23790 6.59283 -1.64507 -30.46510 29.48842 -0.97668
magnitude: 1.99046 au
magnitude: 5.05936 debye
