program: Orca
programVersion: 5.0.2
elementType: Cl Cl F F F F O O C C C C C C C C C C C C C C C H H H H H H H H H H H H
charge: 0
multiplicity: 1
keywords: wb97x-d3
keywords: def2-TZVPP
keywords: def2/J RIJCOSX
keywords: DEFGRID2
keywords: scfconv7
keywords: smallprint printgap noloewdin
keywords: NOSOSCF
formula: C15H12Cl2F4O2
InChI: InChI=1/C15H12Cl2F4O2/c1-15(2)7(3-10(16)17)11(15)14(22)23-5-6-12(20)8(18)4-9(19)13(6)21/h3-4,7,11H,5H2,1-2H3
35 atoms
Cl -3.859646 1.581756 2.012192
Cl -4.491262 3.045649 -0.390628
F  1.06818 0.6613 0.491401
F  4.653124 -2.161476 -0.692876
F  6.305366 -0.069596 -0.634042
F  2.71924 2.741259 0.489415
O  0.645876 -1.722623 -0.72508
O  -0.440508 -2.027812 1.213331
C  -2.960249 -1.941392 -0.658288
C  -1.616351 -1.244499 -0.716508
C  -2.779774 -0.629605 0.045103
C  -3.157956 -3.173888 0.189191
C  -3.725864 -1.99867 -1.958159
C  -3.360293 0.61926 -0.459729
C  -0.444931 -1.706413 0.049468
C  -3.837884 1.60415 0.290728
C  1.906333 -2.031628 -0.140087
C  2.800946 -0.821562 -0.132329
C  2.350007 0.452615 0.181157
C  4.153907 -0.957735 -0.403791
C  5.013322 0.123927 -0.371974
C  3.207887 1.536583 0.195321
C  4.5502 1.387198 -0.076969
H  -1.380264 -0.793851 -1.673588
H  -2.69994 -0.707824 1.123113
H  -2.731521 -3.088829 1.185483
H  -4.226121 -3.36209 0.307764
H  -2.722347 -4.049472 -0.295203
H  -3.500821 -1.169758 -2.62754
H  -3.486933 -2.920432 -2.490852
H  -4.800278 -1.996404 -1.766772
H  -3.397919 0.763398 -1.532813
H  2.342805 -2.821374 -0.747979
H  1.79392 -2.420077 0.872409
H  5.220664 2.236394 -0.053056
elementType: Cl F O C H
totalener: -2049.15400769 hartree
nucrepener: 2223.81571720 hartree
electener: -4272.96972489 hartree
oneelecener: -7244.21138413 hartree
twoeener: 2971.24165924 hartree
cpcmener: -0.02439181 hartree
kineticenergy: 2043.53853300 hartree
xcener: -143.166797464429 hartree
chargesum: 0.0000000
charge: -0.057997 -0.061896 -0.206247 -0.205391 -0.203636 -0.203635 -0.288886 -0.478949 0.090312 -0.082732 0.034293 -0.269334 -0.268470 -0.206138 0.407053 0.042597 0.088004 -0.096117 0.223485 0.207991 0.203988 0.204259 -0.171944 0.100978 0.078348 0.092908 0.098454 0.101220 0.093996 0.098599 0.101413 0.132574 0.123786 0.121653 0.155461
qa: -0.0580 -0.0619 -0.2062 -0.2054 -0.2036 -0.2036 -0.2889 -0.4789 0.0903 -0.0827 0.0343 -0.2693 -0.2685 -0.2061 0.4071 0.0426 0.0880 -0.0961 0.2235 0.2080 0.2040 0.2043 -0.1719 0.1010 0.0783 0.0929 0.0985 0.1012 0.0940 0.0986 0.1014 0.1326 0.1238 0.1217 0.1555
va: 1.2675 1.2430 1.0895 1.0928 1.0847 1.0850 2.1173 2.0250 3.7428 3.8279 3.8574 3.9069 3.9095 3.9052 4.1885 4.2079 3.8315 3.6122 3.8610 3.9161 3.9597 4.0003 3.8706 1.0324 1.0504 1.0188 0.9999 0.9990 1.0052 1.0009 1.0004 1.0180 1.0047 1.0215 0.9978
dispcorr: -0.016426691 hartree
energy: -2049.170434378256
dipole: -20.73404 21.07199 0.33795 -26.42972 25.64009 -0.78963 -9.11542 7.59478 -1.52064
magnitude: 1.74644 au
magnitude: 4.43911 debye
