program: Orca
programVersion: 5.0.2
elementType: Cl Cl F F F F O O C C C C C C C C C C C C C C C H H H H H H H H H H H H
charge: 0
multiplicity: 1
keywords: wb97x-d3
keywords: def2-TZVPP
keywords: def2/J RIJCOSX
keywords: DEFGRID2
keywords: scfconv7
keywords: smallprint printgap noloewdin
keywords: NOSOSCF
formula: C15H12Cl2F4O2
InChI: InChI=1/C15H12Cl2F4O2/c1-15(2)7(3-10(16)17)11(15)14(22)23-5-6-12(20)8(18)4-9(19)13(6)21/h3-4,7,11H,5H2,1-2H3
35 atoms
Cl -3.998456 -1.327949 2.170546
Cl -5.099696 1.318503 1.857568
F  4.603439 0.512096 -2.127292
F  1.335529 -0.234938 1.17648
F  2.739104 1.256287 2.89265
F  6.015379 1.960198 -0.396329
O  0.823862 -0.297573 -1.615556
O  -0.076716 -2.201586 -0.839762
C  -2.669281 -1.00181 -2.13529
C  -1.480316 -0.362498 -1.44679
C  -2.690877 -0.813002 -0.647275
C  -2.595923 -2.41242 -2.666056
C  -3.480884 -0.088853 -3.021585
C  -3.524431 0.205663 0.00031
C  -0.203883 -1.075279 -1.256224
C  -4.114901 0.076722 1.18183
C  2.156287 -0.789554 -1.470004
C  2.924437 0.09131 -0.528142
C  4.123752 0.678703 -0.894176
C  2.481759 0.31198 0.768129
C  3.206257 1.080062 1.657079
C  4.856663 1.436596 0.001457
C  4.406232 1.649017 1.285353
H  -1.382194 0.704448 -1.609008
H  -2.536698 -1.72269 -0.078769
H  -2.129384 -3.112336 -1.976098
H  -3.606826 -2.775996 -2.862812
H  -2.045488 -2.443483 -3.608393
H  -4.525377 -0.404688 -3.039483
H  -3.449239 0.953595 -2.707687
H  -3.104564 -0.131438 -4.04485
H  -3.673836 1.145423 -0.517816
H  2.608195 -0.789091 -2.459288
H  2.165081 -1.816709 -1.10723
H  4.979523 2.243381 1.985083
elementType: Cl F O C H
totalener: -2049.15517685 hartree
nucrepener: 2209.10333620 hartree
electener: -4258.25851305 hartree
oneelecener: -7214.74468708 hartree
twoeener: 2956.48617403 hartree
cpcmener: -0.02469565 hartree
kineticenergy: 2043.54078922 hartree
xcener: -143.166507674755 hartree
chargesum: 0.0000000
charge: -0.058044 -0.062120 -0.204309 -0.204865 -0.203448 -0.203473 -0.288184 -0.482412 0.088809 -0.088332 0.027603 -0.270428 -0.269716 -0.202527 0.429521 0.042991 0.077814 -0.114150 0.219967 0.231087 0.197755 0.205079 -0.167640 0.099085 0.077640 0.093602 0.098644 0.102012 0.101550 0.093688 0.098625 0.132605 0.118175 0.127941 0.155454
qa: -0.0580 -0.0621 -0.2043 -0.2049 -0.2034 -0.2035 -0.2882 -0.4824 0.0888 -0.0883 0.0276 -0.2704 -0.2697 -0.2025 0.4295 0.0430 0.0778 -0.1142 0.2200 0.2311 0.1978 0.2051 -0.1676 0.0991 0.0776 0.0936 0.0986 0.1020 0.1016 0.0937 0.0986 0.1326 0.1182 0.1279 0.1555
va: 1.2675 1.2429 1.0952 1.0946 1.0853 1.0850 2.1212 2.0242 3.7338 3.8358 3.8629 3.9059 3.9103 3.9033 4.1633 4.2078 3.8199 3.6235 3.9045 3.8742 3.9896 3.9586 3.8692 1.0337 1.0503 1.0186 0.9999 0.9986 1.0003 1.0054 1.0010 1.0183 1.0102 1.0202 0.9978
dispcorr: -0.016251951 hartree
energy: -2049.171428801109
dipole: -16.96047 17.37181 0.41134 -10.98178 11.81287 0.83109 -27.54641 26.05835 -1.48806
magnitude: 1.75335 au
magnitude: 4.45666 debye
