program: Orca
programVersion: 5.0.2
elementType: Cl Cl F F F F O O C C C C C C C C C C C C C C C H H H H H H H H H H H H
charge: 0
multiplicity: 1
keywords: wb97x-d3
keywords: def2-TZVPP
keywords: def2/J RIJCOSX
keywords: DEFGRID2
keywords: scfconv7
keywords: smallprint printgap noloewdin
keywords: NOSOSCF
formula: C15H12Cl2F4O2
InChI: InChI=1/C15H12Cl2F4O2/c1-15(2)7(3-10(16)17)11(15)14(22)23-5-6-12(20)8(18)4-9(19)13(6)21/h3-4,7,11H,5H2,1-2H3
35 atoms
Cl -2.473069 2.191827 1.032944
Cl -5.146061 2.069484 -0.046219
F  2.513242 -1.739398 1.353946
F  2.642183 1.059087 -2.420541
F  3.977609 2.897548 -1.009271
F  3.845237 0.111891 2.765379
O  0.40048 -1.262698 -0.920619
O  -0.242824 -2.831443 -2.369584
C  -2.277428 -2.246151 0.437771
C  -1.879751 -1.855056 -0.968671
C  -2.2423 -0.7924 0.046005
C  -1.237736 -2.730782 1.418428
C  -3.600327 -2.956969 0.583915
C  -3.472062 -0.016912 -0.153984
C  -0.508919 -2.044145 -1.493971
C  -3.661419 1.239746 0.22862
C  1.762176 -1.420457 -1.33275
C  2.548756 -0.396815 -0.573969
C  2.872772 -0.601457 0.758686
C  2.93457 0.804518 -1.146137
C  3.626331 1.755965 -0.418628
C  3.560029 0.350327 1.486002
C  3.944345 1.54005 0.904173
H  -2.626799 -2.07965 -1.722066
H  -1.4086 -0.238439 0.458847
H  -0.316284 -2.152742 1.393898
H  -1.631412 -2.667327 2.434321
H  -0.985706 -3.776055 1.229597
H  -4.043983 -2.745603 1.558302
H  -4.324006 -2.677602 -0.180615
H  -3.456226 -4.036132 0.513238
H  -4.299827 -0.500221 -0.659244
H  1.857146 -1.27297 -2.4078
H  2.11321 -2.428527 -1.106953
H  4.482994 2.287229 1.47281
elementType: Cl F O C H
totalener: -2049.16757602 hartree
nucrepener: 2252.23956450 hartree
electener: -4301.40714052 hartree
oneelecener: -7300.22518086 hartree
twoeener: 2998.81804034 hartree
cpcmener: -0.02137874 hartree
kineticenergy: 2043.54257340 hartree
xcener: -143.163409840406 hartree
chargesum: -0.0000000
charge: -0.057769 -0.061052 -0.202612 -0.200822 -0.201134 -0.201224 -0.265913 -0.456047 0.078565 -0.090561 0.060773 -0.252305 -0.269811 -0.222125 0.408743 0.044600 0.066723 -0.201620 0.256736 0.269800 0.184187 0.189406 -0.152183 0.099672 0.079641 0.079935 0.097351 0.101441 0.100197 0.090082 0.098525 0.128719 0.115744 0.130508 0.153831
qa: -0.0578 -0.0611 -0.2026 -0.2008 -0.2011 -0.2012 -0.2659 -0.4560 0.0786 -0.0906 0.0608 -0.2523 -0.2698 -0.2221 0.4087 0.0446 0.0667 -0.2016 0.2567 0.2698 0.1842 0.1894 -0.1522 0.0997 0.0796 0.0799 0.0974 0.1014 0.1002 0.0901 0.0985 0.1287 0.1157 0.1305 0.1538
va: 1.2680 1.2442 1.0992 1.1026 1.0875 1.0884 2.1273 2.0486 3.7547 3.8691 3.8186 3.9086 3.9082 3.8950 4.1779 4.2104 3.8114 3.7257 3.8645 3.8845 3.9660 3.9797 3.8563 1.0292 1.0404 1.0172 1.0017 1.0006 1.0009 1.0061 1.0011 1.0191 1.0128 1.0025 0.9983
dispcorr: -0.017222631 hartree
energy: -2049.184798653811
dipole: -15.43361 15.67553 0.24192 -28.77972 28.36851 -0.41121 0.84396 -0.06629 0.77766
magnitude: 0.91235 au
magnitude: 2.31901 debye
