program: Orca
programVersion: 5.0.2
elementType: Cl Cl F F F F O O C C C C C C C C C C C C C C C H H H H H H H H H H H H
charge: 0
multiplicity: 1
keywords: wb97x-d3
keywords: def2-TZVPP
keywords: def2/J RIJCOSX
keywords: DEFGRID2
keywords: scfconv7
keywords: smallprint printgap noloewdin
keywords: NOSOSCF
formula: C15H12Cl2F4O2
InChI: InChI=1/C15H12Cl2F4O2/c1-15(2)7(3-10(16)17)11(15)14(22)23-5-6-12(20)8(18)4-9(19)13(6)21/h3-4,7,11H,5H2,1-2H3
35 atoms
Cl -1.306506 1.740589 0.43385
Cl -3.74306 2.963627 -0.517136
F  1.286222 0.373889 1.774655
F  3.659497 -1.69708 -1.716692
F  4.921406 0.604189 -2.215795
F  2.529807 2.684055 1.248133
O  0.35196 -1.831083 -0.113086
O  -0.5402 -2.170133 1.918522
C  -3.258953 -2.151409 0.343952
C  -1.917847 -1.489461 0.080565
C  -2.992406 -0.790609 0.887047
C  -3.380944 -3.306388 1.305478
C  -4.144066 -2.285538 -0.870616
C  -3.636197 0.421462 0.33375
C  -0.664873 -1.872582 0.756735
C  -2.984635 1.554172 0.113173
C  1.692799 -1.996304 0.350445
C  2.443245 -0.730285 0.055006
C  2.181982 0.417672 0.78796
C  3.373931 -0.633507 -0.965791
C  4.024996 0.558402 -1.230685
C  2.821819 1.609437 0.516653
C  3.754015 1.691892 -0.496963
H  -1.78123 -1.13277 -0.93335
H  -2.79606 -0.747993 1.955473
H  -2.818474 -3.160135 2.224452
H  -4.42857 -3.440081 1.582537
H  -3.041529 -4.23631 0.84549
H  -5.195965 -2.3128 -0.580604
H  -4.014771 -1.465509 -1.577549
H  -3.924336 -3.213371 -1.401421
H  -4.698618 0.394209 0.118451
H  2.122732 -2.844626 -0.178117
H  1.724726 -2.224682 1.415077
H  4.259286 2.624304 -0.713034
elementType: Cl F O C H
totalener: -2049.16435830 hartree
nucrepener: 2322.94707676 hartree
electener: -4372.11143507 hartree
oneelecener: -7442.73791585 hartree
twoeener: 3070.62648078 hartree
cpcmener: -0.01977026 hartree
kineticenergy: 2043.56550685 hartree
xcener: -143.167656290165 hartree
chargesum: -0.0000000
charge: -0.055910 -0.057164 -0.198673 -0.201834 -0.201934 -0.201230 -0.277596 -0.454537 0.139291 -0.142789 -0.032415 -0.274906 -0.278640 -0.229939 0.399173 0.091023 0.071978 -0.126754 0.217151 0.227763 0.195329 0.209266 -0.161136 0.113106 0.112169 0.094211 0.094978 0.099543 0.100521 0.093340 0.099332 0.139986 0.114795 0.128980 0.153522
qa: -0.0559 -0.0572 -0.1987 -0.2018 -0.2019 -0.2012 -0.2776 -0.4545 0.1393 -0.1428 -0.0324 -0.2749 -0.2786 -0.2299 0.3992 0.0910 0.0720 -0.1268 0.2172 0.2278 0.1953 0.2093 -0.1611 0.1131 0.1122 0.0942 0.0950 0.0995 0.1005 0.0933 0.0993 0.1400 0.1148 0.1290 0.1535
va: 1.2936 1.2488 1.1011 1.1002 1.0866 1.0883 2.1141 2.0536 3.7039 3.8347 3.8739 3.8914 3.9142 3.9187 4.1679 4.1779 3.8104 3.6340 3.8473 3.9315 3.9538 3.9749 3.8624 1.0266 1.0235 1.0198 1.0013 0.9989 0.9999 0.9990 1.0028 1.0085 1.0084 1.0215 0.9984
dispcorr: -0.018561410 hartree
energy: -2049.182919713732
dipole: -27.73653 27.27016 -0.46637 -28.74068 28.12661 -0.61407 3.10581 -3.83884 -0.73303
magnitude: 1.06392 au
magnitude: 2.70426 debye
