program: Orca
programVersion: 5.0.2
elementType: Cl Cl F F F F O O C C C C C C C C C C C C C C C H H H H H H H H H H H H
charge: 0
multiplicity: 1
keywords: wb97x-d3
keywords: def2-TZVPP
keywords: def2/J RIJCOSX
keywords: DEFGRID2
keywords: scfconv7
keywords: smallprint printgap noloewdin
keywords: NOSOSCF
formula: C15H12Cl2F4O2
InChI: InChI=1/C15H12Cl2F4O2/c1-15(2)7(3-10(16)17)11(15)14(22)23-5-6-12(20)8(18)4-9(19)13(6)21/h3-4,7,11H,5H2,1-2H3
35 atoms
Cl -1.66717 1.901876 0.118864
Cl -4.244498 2.831478 -0.794461
F  1.11902 0.649201 1.383459
F  4.064551 -2.029105 -1.119752
F  5.579955 0.114975 -1.618159
F  2.626339 2.800029 0.85157
O  0.378681 -1.712651 -0.104371
O  -0.631226 -1.913818 1.888056
C  -3.193834 -2.168156 0.082902
C  -1.906026 -1.368361 -0.060928
C  -3.098147 -0.802468 0.673154
C  -3.26887 -3.356681 1.00744
C  -3.974418 -2.351365 -1.195592
C  -3.84936 0.338921 0.106354
C  -0.686813 -1.691185 0.704187
C  -3.321725 1.525544 -0.156159
C  1.67559 -1.935642 0.448884
C  2.543604 -0.749002 0.144964
C  2.212224 0.506119 0.633993
C  3.692682 -0.849274 -0.621521
C  4.4785 0.259639 -0.882648
C  2.98963 1.614272 0.364221
C  4.135208 1.501634 -0.395831
H  -1.721193 -0.984534 -1.057553
H  -2.992424 -0.771744 1.755119
H  -4.314148 -3.583779 1.225501
H  -2.830821 -4.241854 0.542679
H  -2.767928 -3.191783 1.958395
H  -5.035494 -2.494583 -0.981716
H  -3.882977 -1.500159 -1.871177
H  -3.624886 -3.235164 -1.732145
H  -4.909927 0.20723 -0.078458
H  2.072942 -2.839672 -0.008143
H  1.626998 -2.106021 1.524389
H  4.751434 2.367472 -0.601857
elementType: Cl F O C H
totalener: -2049.16493481 hartree
nucrepener: 2294.05697829 hartree
electener: -4343.22191310 hartree
oneelecener: -7384.95219014 hartree
twoeener: 3041.73027704 hartree
cpcmener: -0.01939900 hartree
kineticenergy: 2043.55098145 hartree
xcener: -143.165911998405 hartree
chargesum: 0.0000000
charge: -0.053167 -0.058918 -0.201052 -0.202410 -0.201524 -0.200935 -0.280086 -0.456087 0.128924 -0.151746 -0.018160 -0.273450 -0.278267 -0.232015 0.409260 0.087903 0.076671 -0.119649 0.231444 0.221838 0.202431 0.196373 -0.168841 0.115727 0.107356 0.096117 0.098737 0.094776 0.100760 0.093397 0.099965 0.138160 0.114556 0.128454 0.153458
qa: -0.0532 -0.0589 -0.2011 -0.2024 -0.2015 -0.2009 -0.2801 -0.4561 0.1289 -0.1517 -0.0182 -0.2734 -0.2783 -0.2320 0.4093 0.0879 0.0767 -0.1196 0.2314 0.2218 0.2024 0.1964 -0.1688 0.1157 0.1074 0.0961 0.0987 0.0948 0.1008 0.0934 0.1000 0.1382 0.1146 0.1285 0.1535
va: 1.2894 1.2463 1.1007 1.0980 1.0872 1.0889 2.1180 2.0532 3.7100 3.8296 3.8612 3.8962 3.9137 3.9090 4.1765 4.1825 3.8150 3.6314 3.8617 3.9137 3.9597 3.9924 3.8648 1.0255 1.0264 1.0012 0.9992 1.0187 1.0001 0.9988 1.0027 1.0102 1.0098 1.0212 0.9988
dispcorr: -0.018036906 hartree
energy: -2049.182971713007
dipole: -26.61722 26.29037 -0.32685 -28.84661 28.02374 -0.82286 1.95374 -2.67068 -0.71694
magnitude: 1.13927 au
magnitude: 2.89580 debye
