program: Orca
programVersion: 5.0.2
elementType: Cl Cl F F F F O O C C C C C C C C C C C C C C C H H H H H H H H H H H H
charge: 0
multiplicity: 1
keywords: wb97x-d3
keywords: def2-TZVPP
keywords: def2/J RIJCOSX
keywords: DEFGRID2
keywords: scfconv7
keywords: smallprint printgap noloewdin
keywords: NOSOSCF
formula: C15H12Cl2F4O2
InChI: InChI=1/C15H12Cl2F4O2/c1-15(2)7(3-10(16)17)11(15)14(22)23-5-6-12(20)8(18)4-9(19)13(6)21/h3-4,7,11H,5H2,1-2H3
35 atoms
Cl -3.200207 -2.678138 0.631108
Cl -4.734869 -1.060858 2.461412
F  3.831764 1.810692 -1.642609
F  1.431198 -1.618933 0.508413
F  2.874166 -1.229635 2.727418
F  5.286385 2.170717 0.561123
O  0.34181 0.039023 -1.541971
O  0.636387 2.219393 -1.178417
C  -2.633899 0.982001 -1.838967
C  -1.523922 1.310598 -0.862892
C  -2.374737 0.072752 -0.667832
C  -2.312871 0.460899 -3.217943
C  -3.827329 1.906165 -1.825224
C  -3.27934 0.016494 0.487736
C  -0.08652 1.25347 -1.207824
C  -3.675946 -1.091664 1.101398
C  1.726529 -0.117421 -1.846968
C  2.582386 0.087834 -0.629104
C  3.580421 1.047167 -0.579654
C  2.37321 -0.675137 0.509976
C  3.121988 -0.478871 1.654231
C  4.338003 1.234127 0.562064
C  4.114649 0.478001 1.692503
H  -1.739768 2.150151 -0.210881
H  -1.897574 -0.864815 -0.925956
H  -3.198948 -0.008665 -3.649153
H  -2.01915 1.27751 -3.880637
H  -1.518117 -0.282146 -3.226092
H  -3.679175 2.721981 -2.535065
H  -4.730319 1.369071 -2.12212
H  -4.012284 2.35638 -0.850518
H  -3.653324 0.952382 0.885869
H  2.02078 0.547206 -2.658201
H  1.820149 -1.139205 -2.211803
H  4.705629 0.629114 2.586907
elementType: Cl F O C H
totalener: -2049.16651685 hartree
nucrepener: 2265.83989806 hartree
electener: -4315.00641492 hartree
oneelecener: -7328.25153834 hartree
twoeener: 3013.24512343 hartree
cpcmener: -0.02245828 hartree
kineticenergy: 2043.53717503 hartree
xcener: -143.164576788538 hartree
chargesum: -0.0000000
charge: -0.056970 -0.061254 -0.202736 -0.201580 -0.202272 -0.202610 -0.274801 -0.450568 0.076083 -0.107242 0.063536 -0.262488 -0.267092 -0.218757 0.420573 0.042158 0.051440 -0.144333 0.261738 0.218192 0.189881 0.196689 -0.169877 0.097905 0.081513 0.096779 0.100681 0.093424 0.098528 0.100357 0.090395 0.129968 0.124109 0.135337 0.153295
qa: -0.0570 -0.0613 -0.2027 -0.2016 -0.2023 -0.2026 -0.2748 -0.4506 0.0761 -0.1072 0.0635 -0.2625 -0.2671 -0.2188 0.4206 0.0422 0.0514 -0.1443 0.2617 0.2182 0.1899 0.1967 -0.1699 0.0979 0.0815 0.0968 0.1007 0.0934 0.0985 0.1004 0.0904 0.1300 0.1241 0.1353 0.1533
va: 1.2685 1.2436 1.0956 1.0974 1.0872 1.0866 2.1173 2.0658 3.7627 3.8537 3.8000 3.9054 3.9082 3.8912 4.1688 4.2104 3.8518 3.6006 3.8743 3.9214 3.9650 3.9616 3.8677 1.0296 1.0460 1.0005 1.0002 1.0142 1.0014 1.0012 1.0056 1.0179 1.0154 0.9947 0.9989
dispcorr: -0.017474278 hartree
energy: -2049.183991129587
dipole: -18.52543 18.24826 -0.27717 12.94225 -13.08540 -0.14314 -23.92818 23.02306 -0.90512
magnitude: 0.95737 au
magnitude: 2.43345 debye
