program: Orca
programVersion: 5.0.2
elementType: Cl Cl F F F F O O C C C C C C C C C C C C C C C H H H H H H H H H H H H
charge: 0
multiplicity: 1
keywords: wb97x-d3
keywords: def2-TZVPP
keywords: def2/J RIJCOSX
keywords: DEFGRID2
keywords: scfconv7
keywords: smallprint printgap noloewdin
keywords: NOSOSCF
formula: C15H12Cl2F4O2
InChI: InChI=1/C15H12Cl2F4O2/c1-15(2)7(3-10(16)17)11(15)14(22)23-5-6-12(20)8(18)4-9(19)13(6)21/h3-4,7,11H,5H2,1-2H3
35 atoms
Cl -3.879551 1.782737 -0.742975
Cl -6.309533 0.313032 -0.211549
F  2.850628 2.486274 0.204694
F  2.482788 -1.852387 -1.580474
F  4.224612 -2.742404 0.244914
F  4.599222 1.597042 2.00317
O  0.353814 0.108452 -1.583442
O  0.017017 1.116697 0.381073
C  -1.574619 -1.681783 0.635302
C  -1.515094 -0.554989 -0.387801
C  -2.434921 -0.470419 0.797936
C  -0.432584 -1.897741 1.595563
C  -2.200083 -2.964957 0.14818
C  -3.90097 -0.532296 0.60855
C  -0.330353 0.322433 -0.457658
C  -4.599758 0.39362 -0.031697
C  1.589537 0.804411 -1.742713
C  2.609624 0.341222 -0.741398
C  3.174926 1.195234 0.191548
C  2.992745 -0.990941 -0.699718
C  3.895567 -1.451024 0.239262
C  4.086215 0.735725 1.124953
C  4.453522 -0.591933 1.162643
H  -1.960114 -0.795385 -1.347584
H  -2.116743 0.223355 1.572834
H  -0.016222 -0.970423 1.98579
H  -0.774672 -2.484274 2.450332
H  0.376339 -2.456258 1.11942
H  -2.61235 -3.53469 0.983723
H  -3.003851 -2.7959 -0.569337
H  -1.451693 -3.592177 -0.339524
H  -4.445725 -1.363528 1.041951
H  1.437311 1.881805 -1.686942
H  1.91525 0.5741 -2.756136
H  5.163341 -0.951283 1.896793
elementType: Cl F O C H
totalener: -2049.16628603 hartree
nucrepener: 2286.05747051 hartree
electener: -4335.22375654 hartree
oneelecener: -7368.90846039 hartree
twoeener: 3033.68470385 hartree
cpcmener: -0.02064334 hartree
kineticenergy: 2043.55489812 hartree
xcener: -143.166377729455 hartree
chargesum: 0.0000000
charge: -0.049978 -0.057702 -0.202275 -0.201725 -0.203574 -0.202532 -0.273136 -0.446137 0.144248 -0.153894 -0.029304 -0.276741 -0.283994 -0.219076 0.402533 0.070614 0.069534 -0.148662 0.273717 0.193570 0.200967 0.197107 -0.170116 0.115129 0.108672 0.092445 0.102837 0.098712 0.101761 0.094109 0.099280 0.139122 0.121216 0.139848 0.153428
qa: -0.0500 -0.0577 -0.2023 -0.2017 -0.2036 -0.2025 -0.2731 -0.4461 0.1442 -0.1539 -0.0293 -0.2767 -0.2840 -0.2191 0.4025 0.0706 0.0695 -0.1487 0.2737 0.1936 0.2010 0.1971 -0.1701 0.1151 0.1087 0.0924 0.1028 0.0987 0.1018 0.0941 0.0993 0.1391 0.1212 0.1398 0.1534
va: 1.2794 1.2482 1.0971 1.0953 1.0844 1.0866 2.1261 2.0676 3.7231 3.8047 3.8782 3.8972 3.9089 3.9007 4.1897 4.1916 3.8296 3.5811 3.8584 3.9248 3.9430 3.9628 3.8685 1.0231 1.0250 1.0147 1.0027 0.9969 0.9997 0.9988 1.0032 1.0085 1.0181 0.9923 0.9987
dispcorr: -0.018976251 hartree
energy: -2049.185262276466
dipole: -6.14447 6.58354 0.43906 -17.31074 15.90869 -1.40206 4.57411 -4.78182 -0.20770
magnitude: 1.48381 au
magnitude: 3.77154 debye
