program: Orca
programVersion: 5.0.2
elementType: Cl Cl F F F F O O C C C C C C C C C C C C C C C H H H H H H H H H H H H
charge: 0
multiplicity: 1
keywords: wb97x-d3
keywords: def2-TZVPP
keywords: def2/J RIJCOSX
keywords: DEFGRID2
keywords: scfconv7
keywords: smallprint printgap noloewdin
keywords: NOSOSCF
formula: C15H12Cl2F4O2
InChI: InChI=1/C15H12Cl2F4O2/c1-15(2)7(3-10(16)17)11(15)14(22)23-5-6-12(20)8(18)4-9(19)13(6)21/h3-4,7,11H,5H2,1-2H3
35 atoms
Cl -4.495006 1.577279 1.53191
Cl -6.383839 0.413225 -0.311176
F  3.28475 2.550551 -0.522829
F  2.525562 -2.0553 -1.13554
F  4.090194 -2.586678 0.964734
F  4.894882 2.005596 1.536047
O  0.699228 -0.095815 -1.961644
O  0.195339 1.131753 -0.166598
C  -1.575216 -1.548001 0.164176
C  -1.329529 -0.547812 -0.945827
C  -2.384078 -0.277846 0.099973
C  -0.57572 -1.687514 1.286264
C  -2.197127 -2.862084 -0.239213
C  -3.795696 -0.275466 -0.302446
C  -0.096029 0.267969 -0.955735
C  -4.75187 0.467987 0.240205
C  1.964998 0.549552 -2.068804
C  2.856602 0.262535 -0.892173
C  3.477018 1.276409 -0.179712
C  3.092638 -1.040598 -0.480914
C  3.904524 -1.317207 0.602415
C  4.307048 0.997427 0.890823
C  4.525911 -0.301125 1.297816
H  -1.669798 -0.861429 -1.927366
H  -2.107481 0.465649 0.838788
H  0.271272 -2.302085 0.973556
H  -0.187445 -0.733661 1.639051
H  -1.042983 -2.182917 2.139264
H  -2.790742 -3.272264 0.580531
H  -2.843235 -2.781767 -1.112583
H  -1.418692 -3.588891 -0.478856
H  -4.091631 -0.925012 -1.117665
H  1.834018 1.621839 -2.211484
H  2.406251 0.150932 -2.981564
H  5.171727 -0.517367 2.139168
elementType: Cl F O C H
totalener: -2049.16817967 hartree
nucrepener: 2249.50923119 hartree
electener: -4298.67741086 hartree
oneelecener: -7295.59409360 hartree
twoeener: 2996.91668274 hartree
cpcmener: -0.02161630 hartree
kineticenergy: 2043.53115342 hartree
xcener: -143.163428674298 hartree
chargesum: 0.0000000
charge: -0.056344 -0.061686 -0.203340 -0.202685 -0.203484 -0.202416 -0.272047 -0.445525 0.092289 -0.068228 0.024747 -0.264590 -0.267373 -0.206659 0.378421 0.040269 0.062968 -0.119875 0.259241 0.185953 0.201598 0.196499 -0.170980 0.101660 0.075719 0.094784 0.092197 0.103090 0.101568 0.090433 0.097507 0.129553 0.124100 0.138908 0.153728
qa: -0.0563 -0.0617 -0.2033 -0.2027 -0.2035 -0.2024 -0.2720 -0.4455 0.0923 -0.0682 0.0247 -0.2646 -0.2674 -0.2067 0.3784 0.0403 0.0630 -0.1199 0.2592 0.1860 0.2016 0.1965 -0.1710 0.1017 0.0757 0.0948 0.0922 0.1031 0.1016 0.0904 0.0975 0.1296 0.1241 0.1389 0.1537
va: 1.2691 1.2429 1.0963 1.0930 1.0858 1.0864 2.1290 2.0686 3.7490 3.7956 3.8809 3.9020 3.9024 3.8960 4.2372 4.2089 3.8400 3.5608 3.8904 3.9143 3.9564 3.9579 3.8662 1.0297 1.0510 1.0030 1.0166 1.0017 1.0009 1.0056 1.0017 1.0184 1.0166 0.9917 0.9985
dispcorr: -0.018064280 hartree
energy: -2049.186243949695
dipole: -5.06141 5.82712 0.76571 -16.55418 15.13203 -1.42215 -3.95340 3.01936 -0.93404
magnitude: 1.86581 au
magnitude: 4.74251 debye
