program: Orca
programVersion: 5.0.2
elementType: Cl Cl F F F F O O C C C C C C C C C C C C C C C H H H H H H H H H H H H
charge: 0
multiplicity: 1
keywords: wb97x-d3
keywords: def2-TZVPP
keywords: def2/J RIJCOSX
keywords: DEFGRID2
keywords: scfconv7
keywords: smallprint printgap noloewdin
keywords: NOSOSCF
formula: C15H12Cl2F4O2
InChI: InChI=1/C15H12Cl2F4O2/c1-15(2)7(3-10(16)17)11(15)14(22)23-5-6-12(20)8(18)4-9(19)13(6)21/h3-4,7,11H,5H2,1-2H3
35 atoms
Cl -2.083908 1.364187 2.130521
Cl -4.222769 2.703376 0.733097
F  0.969478 1.552342 -1.016098
F  4.113552 -1.939336 -0.799892
F  5.058769 -0.941188 1.499733
F  1.883109 2.504055 1.313684
O  0.529396 -0.822697 -2.284385
O  0.408845 -2.067289 -0.432743
C  -2.673458 -2.053175 -0.880951
C  -1.583671 -1.155645 -1.412932
C  -2.335966 -0.80035 -0.132239
C  -2.35663 -3.372899 -0.219007
C  -3.931398 -2.10839 -1.717441
C  -3.199361 0.38582 -0.116915
C  -0.13683 -1.434382 -1.29545
C  -3.1669 1.347651 0.798178
C  1.945442 -0.843365 -2.223816
C  2.497549 -0.239516 -0.958395
C  1.965958 0.915731 -0.40457
C  3.552907 -0.843031 -0.292858
C  4.047429 -0.327904 0.890806
C  2.443395 1.417315 0.792844
C  3.491164 0.803995 1.447892
H  -1.848375 -0.570504 -2.285922
H  -1.755904 -0.960541 0.76946
H  -1.505377 -3.319045 0.453318
H  -3.222467 -3.702533 0.357734
H  -2.144598 -4.140401 -0.964999
H  -3.859291 -2.91531 -2.447873
H  -4.803312 -2.30362 -1.091306
H  -4.118729 -1.190784 -2.274679
H  -3.921328 0.506236 -0.914794
H  2.268346 -0.268564 -3.092021
H  2.317069 -1.861587 -2.342217
H  3.869709 1.20497 2.378011
totalener: -2049.14834339 hartree
nucrepener: 2317.98728390 hartree
electener: -4367.13562729 hartree
oneelecener: -7432.65130691 hartree
twoeener: 3065.51567962 hartree
kineticenergy: 2043.58774384 hartree
xcener: -143.171093491237 hartree
chargesum: -0.0000000
charge: -0.040224 -0.046145 -0.182301 -0.190770 -0.184047 -0.182821 -0.264527 -0.373564 0.097916 -0.053059 -0.004662 -0.243625 -0.266098 -0.181491 0.318581 0.049108 0.058715 -0.116983 0.190968 0.244710 0.183434 0.186549 -0.178124 0.080659 0.088777 0.103587 0.085925 0.085421 0.094309 0.102321 0.075048 0.096798 0.115204 0.120073 0.130339
qa: -0.0402 -0.0461 -0.1823 -0.1908 -0.1840 -0.1828 -0.2645 -0.3736 0.0979 -0.0531 -0.0047 -0.2436 -0.2661 -0.1815 0.3186 0.0491 0.0587 -0.1170 0.1910 0.2447 0.1834 0.1865 -0.1781 0.0807 0.0888 0.1036 0.0859 0.0854 0.0943 0.1023 0.0750 0.0968 0.1152 0.1201 0.1303
va: 1.2882 1.2594 1.1198 1.1130 1.1108 1.1126 2.1246 2.1218 3.7606 3.8209 3.8865 3.9042 3.9140 3.9122 4.2307 4.2560 3.8839 3.5887 3.9401 3.9067 3.9915 3.9952 3.8768 1.0354 1.0471 1.0237 1.0007 1.0031 1.0045 1.0012 1.0082 1.0317 0.9918 1.0145 1.0079
dispcorr: -0.017913319 hartree
energy: -2049.166256705447
dipole: -20.33122 19.99203 -0.33919 -24.91764 24.59024 -0.32740 -15.51136 14.62277 -0.88859
magnitude: 1.00590 au
magnitude: 2.55679 debye
