program: Orca
programVersion: 5.0.2
elementType: Cl Cl F F F F O O C C C C C C C C C C C C C C C H H H H H H H H H H H H
charge: 0
multiplicity: 1
keywords: wb97x-d3
keywords: def2-TZVPP
keywords: def2/J RIJCOSX
keywords: DEFGRID2
keywords: scfconv7
keywords: smallprint printgap noloewdin
keywords: NOSOSCF
formula: C15H12Cl2F4O2
InChI: InChI=1/C15H12Cl2F4O2/c1-15(2)7(3-10(16)17)11(15)14(22)23-5-6-12(20)8(18)4-9(19)13(6)21/h3-4,7,11H,5H2,1-2H3
35 atoms
Cl -4.30783 0.293857 1.809197
Cl -6.332959 -0.006125 -0.224166
F  3.541185 1.487956 -2.002235
F  1.576823 0.394936 2.128901
F  3.609998 -1.284344 2.64513
F  5.55205 -0.1970 -1.483221
O  0.119384 1.147598 -0.389436
O  0.642017 0.733246 -2.525251
C  -1.444799 -1.563259 -0.956817
C  -1.332461 -0.223678 -1.648297
C  -2.28561 -0.401155 -0.492279
C  -0.339386 -2.034191 -0.04311
C  -2.07352 -2.683179 -1.749265
C  -3.732246 -0.343508 -0.741799
C  -0.093139 0.590523 -1.588506
C  -4.658934 -0.056667 0.164219
C  1.324169 1.885929 -0.217412
C  2.49084 0.974408 0.043583
C  3.525271 0.806243 -0.865287
C  2.547963 0.251336 1.228021
C  3.591246 -0.612736 1.497371
C  4.573859 -0.059011 -0.593939
C  4.613901 -0.774475 0.583937
H  -1.76808 -0.196413 -2.64157
H  -1.96795 0.034869 0.446831
H  0.018094 -1.255474 0.626064
H  -0.697364 -2.85491 0.580269
H  0.509984 -2.404128 -0.620808
H  -2.559758 -3.398981 -1.084561
H  -2.819838 -2.33627 -2.462954
H  -1.309992 -3.218216 -2.315854
H  -4.088257 -0.546145 -1.744589
H  1.143896 2.524126 0.646075
H  1.516613 2.526211 -1.0768
H  5.434691 -1.447955 0.789697
totalener: -2049.14889327 hartree
nucrepener: 2261.14715466 hartree
electener: -4310.29604793 hartree
oneelecener: -7318.41981275 hartree
twoeener: 3008.12376482 hartree
kineticenergy: 2043.57549476 hartree
xcener: -143.166504173268 hartree
chargesum: -0.0000000
charge: -0.042757 -0.045783 -0.172280 -0.186524 -0.182874 -0.180601 -0.260480 -0.344759 0.070981 -0.091194 0.081711 -0.268533 -0.244184 -0.226006 0.329196 0.053090 0.038115 -0.175368 0.292920 0.164798 0.202629 0.174651 -0.172200 0.082253 0.080221 0.087605 0.094658 0.101387 0.097013 0.070809 0.096912 0.097996 0.122684 0.121016 0.132898
qa: -0.0428 -0.0458 -0.1723 -0.1865 -0.1829 -0.1806 -0.2605 -0.3448 0.0710 -0.0912 0.0817 -0.2685 -0.2442 -0.2260 0.3292 0.0531 0.0381 -0.1754 0.2929 0.1648 0.2026 0.1747 -0.1722 0.0823 0.0802 0.0876 0.0947 0.1014 0.0970 0.0708 0.0969 0.0980 0.1227 0.1210 0.1329
va: 1.2848 1.2601 1.1361 1.1155 1.1141 1.1147 2.1217 2.1580 3.7655 3.8437 3.7606 3.9250 3.9094 3.9236 4.3014 4.2410 3.8796 3.6066 3.8787 3.9006 3.9843 3.9991 3.8744 1.0325 1.0474 1.0099 1.0057 0.9989 1.0028 1.0102 1.0029 1.0288 0.9954 1.0170 1.0072
dispcorr: -0.018461984 hartree
energy: -2049.167355255962
dipole: -4.85625 5.14498 0.28873 -12.31897 11.95221 -0.36676 -11.15383 11.39876 0.24494
magnitude: 0.52714 au
magnitude: 1.33987 debye
