program: Orca
programVersion: 5.0.2
elementType: Cl Cl F F F F O O C C C C C C C C C C C C C C C H H H H H H H H H H H H
charge: 0
multiplicity: 1
keywords: wb97x-d3
keywords: def2-TZVPP
keywords: def2/J RIJCOSX
keywords: DEFGRID2
keywords: scfconv7
keywords: smallprint printgap noloewdin
keywords: NOSOSCF
formula: C15H12Cl2F4O2
InChI: InChI=1/C15H12Cl2F4O2/c1-15(2)7(3-10(16)17)11(15)14(22)23-5-6-12(20)8(18)4-9(19)13(6)21/h3-4,7,11H,5H2,1-2H3
35 atoms
Cl -2.962577 0.997997 2.147871
Cl -5.560962 1.610661 1.051237
F  2.483264 2.43439 -0.610435
F  2.464613 -2.265565 -0.697707
F  4.040899 -2.308177 1.473836
F  4.057099 2.385756 1.552795
O  0.255115 -0.142004 -1.550239
O  -0.370114 -0.130578 -3.693417
C  -2.37405 -1.792889 -1.235184
C  -2.013303 -0.569792 -2.051246
C  -2.444823 -0.42768 -0.60818
C  -1.307448 -2.742489 -0.746138
C  -3.647452 -2.504464 -1.628635
C  -3.725706 0.229876 -0.316534
C  -0.645725 -0.262847 -2.532432
C  -4.033583 0.858332 0.811379
C  1.599649 0.095896 -1.958834
C  2.450014 0.084439 -0.725559
C  2.859184 1.259281 -0.113803
C  2.852892 -1.114134 -0.153874
C  3.660569 -1.139297 0.967585
C  3.669862 1.23721 1.007995
C  4.075764 0.038458 1.556706
H  -2.74951 -0.303487 -2.801667
H  -1.649381 -0.213129 0.094949
H  -1.701092 -3.342289 0.07593
H  -1.00819 -3.428898 -1.540284
H  -0.414773 -2.239927 -0.384579
H  -4.392649 -1.842559 -2.068103
H  -3.432656 -3.280237 -2.364919
H  -4.102228 -2.984717 -0.760853
H  -4.491867 0.215736 -1.081946
H  1.67531 1.052394 -2.475857
H  1.928087 -0.674298 -2.658665
H  4.708306 0.021194 2.433856
totalener: -2049.15055857 hartree
nucrepener: 2239.42728432 hartree
electener: -4288.57784289 hartree
oneelecener: -7274.68217043 hartree
twoeener: 2986.10432754 hartree
kineticenergy: 2043.57299690 hartree
xcener: -143.165255158789 hartree
chargesum: 0.0000000
charge: -0.043951 -0.045042 -0.183171 -0.186380 -0.180678 -0.179638 -0.268099 -0.351462 0.065545 -0.088516 0.084145 -0.243514 -0.243070 -0.223938 0.329708 0.053372 0.057276 -0.206513 0.273641 0.248946 0.172228 0.162988 -0.154431 0.080998 0.078557 0.090437 0.095268 0.079497 0.072285 0.095177 0.097422 0.096949 0.114460 0.115899 0.133607
qa: -0.0440 -0.0450 -0.1832 -0.1864 -0.1807 -0.1796 -0.2681 -0.3515 0.0655 -0.0885 0.0841 -0.2435 -0.2431 -0.2239 0.3297 0.0534 0.0573 -0.2065 0.2736 0.2489 0.1722 0.1630 -0.1544 0.0810 0.0786 0.0904 0.0953 0.0795 0.0723 0.0952 0.0974 0.0969 0.1145 0.1159 0.1336
va: 1.2837 1.2607 1.1243 1.1166 1.1160 1.1160 2.1084 2.1530 3.7528 3.8800 3.7623 3.9229 3.9148 3.9256 4.2735 4.2424 3.8348 3.7152 3.8748 3.8590 4.0168 4.0065 3.8569 1.0337 1.0467 1.0032 1.0023 1.0190 1.0105 1.0038 1.0026 1.0298 1.0110 1.0056 1.0070
dispcorr: -0.017131400 hartree
energy: -2049.167689972618
dipole: -14.51860 14.76249 0.24388 -19.63005 18.96531 -0.66475 -18.07503 18.33576 0.26074
magnitude: 0.75455 au
magnitude: 1.91792 debye
