program: Orca
programVersion: 5.0.2
elementType: Cl Cl F F F F O O C C C C C C C C C C C C C C C H H H H H H H H H H H H
charge: 0
multiplicity: 1
keywords: wb97x-d3
keywords: def2-TZVPP
keywords: def2/J RIJCOSX
keywords: DEFGRID2
keywords: scfconv7
keywords: smallprint printgap noloewdin
keywords: NOSOSCF
formula: C15H12Cl2F4O2
InChI: InChI=1/C15H12Cl2F4O2/c1-15(2)7(3-10(16)17)11(15)14(22)23-5-6-12(20)8(18)4-9(19)13(6)21/h3-4,7,11H,5H2,1-2H3
35 atoms
Cl -1.466823 1.501619 0.660599
Cl -4.333973 1.845803 0.593363
F  4.088083 -1.244926 -0.248594
F  0.901255 1.943645 -1.579442
F  1.339978 3.317387 0.687228
F  4.562829 0.159759 1.979715
O  0.705272 -0.8426 -2.174931
O  0.92361 -2.003923 -0.277963
C  -2.080766 -2.736585 -0.653961
C  -1.252258 -1.587308 -1.191352
C  -2.013592 -1.465614 0.12061
C  -1.428447 -3.968777 -0.075818
C  -3.332999 -3.04275 -1.44136
C  -3.150404 -0.527071 0.214777
C  0.222981 -1.537497 -1.13569
C  -3.00375 0.769024 0.457159
C  2.094171 -0.53724 -2.155836
C  2.4591 0.296295 -0.957656
C  3.404509 -0.125314 -0.036622
C  1.792497 1.48634 -0.703839
C  2.029318 2.203019 0.454269
C  3.656718 0.602917 1.112073
C  2.964758 1.767604 1.370751
H  -1.683386 -1.05802 -2.03294
H  -1.371067 -1.493213 0.996627
H  -2.15257 -4.507202 0.538135
H  -1.102458 -4.643685 -0.868753
H  -0.566044 -3.741527 0.544056
H  -3.771291 -2.157301 -1.902635
H  -3.113635 -3.750939 -2.24142
H  -4.091423 -3.496349 -0.800008
H  -4.159607 -0.903509 0.099508
H  2.270968 0.012307 -3.079474
H  2.692686 -1.447459 -2.18624
H  3.152369 2.33115 2.274438
totalener: -2049.14796852 hartree
nucrepener: 2376.68037354 hartree
electener: -4425.82834205 hartree
oneelecener: -7550.13188409 hartree
twoeener: 3124.30354204 hartree
kineticenergy: 2043.59485476 hartree
xcener: -143.171158903179 hartree
chargesum: 0.0000000
charge: -0.032700 -0.041799 -0.187296 -0.176853 -0.184578 -0.184140 -0.259563 -0.384273 0.128527 -0.081958 -0.072467 -0.244380 -0.278582 -0.209000 0.335525 0.078980 0.065744 -0.154485 0.291790 0.147947 0.185349 0.185341 -0.166638 0.092128 0.114507 0.083936 0.086455 0.104694 0.082087 0.094787 0.097003 0.117868 0.119924 0.115096 0.131027
qa: -0.0327 -0.0418 -0.1873 -0.1769 -0.1846 -0.1841 -0.2596 -0.3843 0.1285 -0.0820 -0.0725 -0.2444 -0.2786 -0.2090 0.3355 0.0790 0.0657 -0.1545 0.2918 0.1479 0.1853 0.1853 -0.1666 0.0921 0.1145 0.0839 0.0865 0.1047 0.0821 0.0948 0.0970 0.1179 0.1199 0.1151 0.1310
va: 1.3203 1.2649 1.1188 1.1214 1.1074 1.1115 2.1271 2.1138 3.7430 3.8232 3.9064 3.8882 3.9177 3.8673 4.2015 4.2118 3.8702 3.6160 3.8482 3.9603 3.9470 3.9979 3.8773 1.0300 1.0241 1.0015 1.0028 1.0240 1.0015 1.0065 0.9996 1.0163 0.9915 1.0179 1.0074
dispcorr: -0.019473369 hartree
energy: -2049.167441886253
dipole: -15.86851 15.44030 -0.42820 -32.07264 31.57562 -0.49703 -10.05137 9.47475 -0.57662
magnitude: 0.87344 au
magnitude: 2.22010 debye
