program: Orca
programVersion: 5.0.2
elementType: Cl Cl F F F F O O C C C C C C C C C C C C C C C H H H H H H H H H H H H
charge: 0
multiplicity: 1
keywords: wb97x-d3
keywords: def2-TZVPP
keywords: def2/J RIJCOSX
keywords: DEFGRID2
keywords: scfconv7
keywords: smallprint printgap noloewdin
keywords: NOSOSCF
formula: C15H12Cl2F4O2
InChI: InChI=1/C15H12Cl2F4O2/c1-15(2)7(3-10(16)17)11(15)14(22)23-5-6-12(20)8(18)4-9(19)13(6)21/h3-4,7,11H,5H2,1-2H3
35 atoms
Cl -1.319345 1.73273 0.244386
Cl -3.790744 2.921428 -0.657394
F  1.261895 0.377764 1.760965
F  3.737709 -1.70667 -1.648048
F  5.057499 0.584194 -2.082515
F  2.57562 2.675006 1.306837
O  0.366285 -1.8065 -0.166548
O  -0.555619 -2.196482 1.844513
C  -3.251526 -2.16603 0.272631
C  -1.915316 -1.499135 0.004146
C  -2.989173 -0.797833 0.806647
C  -3.366162 -3.316976 1.241936
C  -4.146668 -2.311563 -0.935052
C  -3.644317 0.405214 0.248018
C  -0.663307 -1.879705 0.691749
C  -3.002537 1.534993 -0.019469
C  1.688259 -1.986723 0.326937
C  2.466881 -0.726387 0.076023
C  2.192479 0.418071 0.812354
C  3.441074 -0.640946 -0.906193
C  4.125253 0.541231 -1.135295
C  2.86828 1.600602 0.5806
C  3.842473 1.669982 -0.395727
H  -1.775014 -1.145182 -1.01046
H  -2.78409 -0.749975 1.873507
H  -3.050434 -4.250465 0.772998
H  -2.770876 -3.176087 2.139598
H  -4.407981 -3.436828 1.544103
H  -3.916391 -3.233107 -1.471446
H  -5.194765 -2.360834 -0.63293
H  -4.042034 -1.485704 -1.639335
H  -4.712406 0.380501 0.065312
H  2.13031 -2.826008 -0.207053
H  1.679554 -2.232054 1.389191
H  4.37378 2.59411 -0.577896
totalener: -2049.14869872 hartree
nucrepener: 2318.60159821 hartree
electener: -4367.75029693 hartree
oneelecener: -7433.73392795 hartree
twoeener: 3065.98363102 hartree
kineticenergy: 2043.58334360 hartree
xcener: -143.167631393237 hartree
chargesum: 0.0000000
charge: -0.036555 -0.043266 -0.175555 -0.188013 -0.182393 -0.180668 -0.264833 -0.378122 0.124087 -0.154781 -0.023918 -0.253121 -0.268777 -0.252372 0.367810 0.104714 0.050598 -0.143237 0.214829 0.224808 0.180950 0.192998 -0.166398 0.105397 0.111500 0.086829 0.105062 0.083709 0.095099 0.092465 0.086828 0.118290 0.104066 0.129304 0.132665
qa: -0.0366 -0.0433 -0.1756 -0.1880 -0.1824 -0.1807 -0.2648 -0.3781 0.1241 -0.1548 -0.0239 -0.2531 -0.2688 -0.2524 0.3678 0.1047 0.0506 -0.1432 0.2148 0.2248 0.1809 0.1930 -0.1664 0.1054 0.1115 0.0868 0.1051 0.0837 0.0951 0.0925 0.0868 0.1183 0.1041 0.1293 0.1327
va: 1.3126 1.2626 1.1303 1.1164 1.1124 1.1154 2.1146 2.1234 3.7107 3.8802 3.8512 3.9019 3.9133 3.9187 4.1848 4.1949 3.8503 3.6551 3.8525 3.9182 3.9881 4.0117 3.8661 1.0270 1.0251 1.0019 1.0223 1.0023 1.0062 1.0013 1.0009 1.0167 1.0073 1.0203 1.0072
dispcorr: -0.018462742 hartree
energy: -2049.167161466114
dipole: -27.84383 27.50864 -0.33518 -28.73440 28.29489 -0.43951 3.01069 -3.41632 -0.40563
magnitude: 0.68560 au
magnitude: 1.74266 debye
