program: Orca
programVersion: 5.0.2
elementType: Cl Cl F F F F O O C C C C C C C C C C C C C C C H H H H H H H H H H H H
charge: 0
multiplicity: 1
keywords: wb97x-d3
keywords: def2-TZVPP
keywords: def2/J RIJCOSX
keywords: DEFGRID2
keywords: scfconv7
keywords: smallprint printgap noloewdin
keywords: NOSOSCF
formula: C15H12Cl2F4O2
InChI: InChI=1/C15H12Cl2F4O2/c1-15(2)7(3-10(16)17)11(15)14(22)23-5-6-12(20)8(18)4-9(19)13(6)21/h3-4,7,11H,5H2,1-2H3
35 atoms
Cl -1.290541 1.718104 0.206214
Cl -3.744386 2.907892 -0.742618
F  1.257707 0.397776 1.760102
F  3.72695 -1.705473 -1.642083
F  5.039514 0.585186 -2.097512
F  2.562433 2.695342 1.283484
O  0.365271 -1.81034 -0.146191
O  -0.552068 -2.193279 1.868243
C  -3.259487 -2.16808 0.322495
C  -1.918646 -1.525971 0.0208
C  -2.980481 -0.784825 0.805256
C  -3.383845 -3.279827 1.335383
C  -4.163021 -2.348779 -0.874482
C  -3.624668 0.406566 0.209735
C  -0.663683 -1.887898 0.712846
C  -2.972941 1.526998 -0.073049
C  1.689041 -1.977412 0.34717
C  2.460211 -0.715986 0.079989
C  2.184805 0.433571 0.807919
C  3.429862 -0.635179 -0.90701
C  4.109753 0.547231 -1.147589
C  2.856045 1.616268 0.56454
C  3.826564 1.680995 -0.415791
H  -1.783032 -1.207499 -1.006163
H  -2.766433 -0.700884 1.868059
H  -3.084832 -4.234996 0.900478
H  -2.780795 -3.114289 2.223581
H  -4.425508 -3.372348 1.647724
H  -5.210362 -2.371667 -0.566569
H  -4.050344 -1.55327 -1.611761
H  -3.947772 -3.294032 -1.374651
H  -4.690369 0.381705 0.013777
H  2.134829 -2.820882 -0.177089
H  1.683261 -2.209402 1.412372
H  4.354555 2.605134 -0.607337
totalener: -2049.14863504 hartree
nucrepener: 2320.38788965 hartree
electener: -4369.53652469 hartree
oneelecener: -7437.30796174 hartree
twoeener: 3067.77143705 hartree
kineticenergy: 2043.58067501 hartree
xcener: -143.167064366815 hartree
chargesum: 0.0000000
charge: -0.036799 -0.043043 -0.175576 -0.187970 -0.182406 -0.180669 -0.264778 -0.378223 0.125793 -0.153324 -0.027735 -0.252389 -0.269388 -0.250558 0.367697 0.104433 0.050282 -0.141537 0.211356 0.225042 0.180736 0.194507 -0.166255 0.104543 0.112296 0.086513 0.105185 0.083456 0.092591 0.086788 0.095063 0.118376 0.103922 0.129330 0.132744
qa: -0.0368 -0.0430 -0.1756 -0.1880 -0.1824 -0.1807 -0.2648 -0.3782 0.1258 -0.1533 -0.0277 -0.2524 -0.2694 -0.2506 0.3677 0.1044 0.0503 -0.1415 0.2114 0.2250 0.1807 0.1945 -0.1663 0.1045 0.1123 0.0865 0.1052 0.0835 0.0926 0.0868 0.0951 0.1184 0.1039 0.1293 0.1327
va: 1.3126 1.2629 1.1300 1.1165 1.1124 1.1154 2.1141 2.1233 3.7110 3.8798 3.8556 3.9011 3.9136 3.9190 4.1836 4.1950 3.8509 3.6539 3.8525 3.9189 3.9876 4.0105 3.8663 1.0273 1.0244 1.0021 1.0227 1.0022 1.0013 1.0009 1.0064 1.0164 1.0072 1.0203 1.0072
dispcorr: -0.018493948 hartree
energy: -2049.167128983823
dipole: -28.00638 27.66198 -0.34440 -28.71317 28.27719 -0.43598 3.68669 -4.08052 -0.39383
magnitude: 0.68102 au
magnitude: 1.73102 debye
