program: Orca
programVersion: 5.0.2
elementType: Cl Cl F F F F O O C C C C C C C C C C C C C C C H H H H H H H H H H H H
charge: 0
multiplicity: 1
keywords: wb97x-d3
keywords: def2-TZVPP
keywords: def2/J RIJCOSX
keywords: DEFGRID2
keywords: scfconv7
keywords: smallprint printgap noloewdin
keywords: NOSOSCF
formula: C15H12Cl2F4O2
InChI: InChI=1/C15H12Cl2F4O2/c1-15(2)7(3-10(16)17)11(15)14(22)23-5-6-12(20)8(18)4-9(19)13(6)21/h3-4,7,11H,5H2,1-2H3
35 atoms
Cl -1.971803 1.797372 1.053027
Cl -4.538617 2.789538 0.185236
F  1.543099 1.336317 1.395194
F  3.582951 -2.246719 -0.859467
F  5.24385 -0.532023 -2.078658
F  3.211349 3.051631 0.169021
O  0.326248 -1.286162 0.287399
O  -0.766361 -2.190384 2.015608
C  -3.19751 -2.228795 0.028638
C  -1.982209 -1.326324 0.141352
C  -3.254584 -1.013611 0.892691
C  -3.219102 -3.59005 0.679083
C  -3.895006 -2.194005 -1.310866
C  -4.047218 0.181863 0.531482
C  -0.781436 -1.667554 0.933285
C  -3.578689 1.422078 0.582897
C  1.563333 -1.429328 0.97714
C  2.528646 -0.498413 0.309063
C  2.451054 0.867383 0.543259
C  3.480273 -0.946996 -0.592218
C  4.339276 -0.063591 -1.223794
C  3.30762 1.750824 -0.08554
C  4.25746 1.290545 -0.976252
H  -1.780388 -0.720684 -0.734286
H  -3.193938 -1.207591 1.961019
H  -4.251457 -3.925807 0.791287
H  -2.701316 -4.32281 0.057904
H  -2.756426 -3.59803 1.662179
H  -3.862061 -1.208223 -1.775636
H  -3.432243 -2.9001 -2.001478
H  -4.944176 -2.476851 -1.206033
H  -5.081751 0.049772 0.236287
H  1.906904 -2.462775 0.926971
H  1.450475 -1.176799 2.032249
H  4.926802 1.981539 -1.470296
totalener: -2049.15069083 hartree
nucrepener: 2266.07077214 hartree
electener: -4315.22146297 hartree
oneelecener: -7328.53601010 hartree
twoeener: 3013.31454712 hartree
kineticenergy: 2043.58928928 hartree
xcener: -143.168177885415 hartree
chargesum: 0.0000000
charge: -0.032137 -0.043176 -0.186754 -0.186495 -0.182003 -0.180844 -0.254879 -0.384425 0.119459 -0.146212 -0.017831 -0.251135 -0.266183 -0.251920 0.355289 0.100318 0.055717 -0.194155 0.249063 0.263505 0.169761 0.182010 -0.161710 0.105063 0.107924 0.084136 0.086978 0.104110 0.086665 0.095855 0.092608 0.118442 0.112476 0.117871 0.132611
qa: -0.0321 -0.0432 -0.1868 -0.1865 -0.1820 -0.1808 -0.2549 -0.3844 0.1195 -0.1462 -0.0178 -0.2511 -0.2662 -0.2519 0.3553 0.1003 0.0557 -0.1942 0.2491 0.2635 0.1698 0.1820 -0.1617 0.1051 0.1079 0.0841 0.0870 0.1041 0.0867 0.0959 0.0926 0.1184 0.1125 0.1179 0.1326
va: 1.3109 1.2624 1.1164 1.1190 1.1131 1.1147 2.1220 2.1131 3.7205 3.9046 3.8394 3.9014 3.9148 3.9100 4.1781 4.1985 3.8424 3.6998 3.8825 3.8802 3.9998 4.0022 3.8616 1.0238 1.0274 1.0024 1.0019 1.0213 1.0008 1.0063 1.0018 1.0176 1.0081 1.0094 1.0073
dispcorr: -0.017465879 hartree
energy: -2049.168156709198
dipole: -25.73395 25.54993 -0.18402 -28.33518 27.97724 -0.35794 -0.85852 0.28209 -0.57643
magnitude: 0.70304 au
magnitude: 1.78698 debye
