program: Orca
programVersion: 5.0.2
elementType: Cl Cl F F F F O O C C C C C C C C C C C C C C C H H H H H H H H H H H H
charge: 0
multiplicity: 1
keywords: wb97x-d3
keywords: def2-TZVPP
keywords: def2/J RIJCOSX
keywords: DEFGRID2
keywords: scfconv7
keywords: smallprint printgap noloewdin
keywords: NOSOSCF
formula: C15H12Cl2F4O2
InChI: InChI=1/C15H12Cl2F4O2/c1-15(2)7(3-10(16)17)11(15)14(22)23-5-6-12(20)8(18)4-9(19)13(6)21/h3-4,7,11H,5H2,1-2H3
35 atoms
Cl -4.050448 1.506303 1.930237
Cl -4.383975 3.0513 -0.482356
F  1.211821 0.702246 0.803939
F  4.609141 -2.211606 -0.638496
F  6.223574 -0.110896 -1.055077
F  2.820372 2.800735 0.335251
O  0.730171 -1.734626 -0.427837
O  -0.546232 -2.144534 1.371458
C  -2.902286 -1.938121 -0.672695
C  -1.534884 -1.290415 -0.630335
C  -2.727293 -0.633443 0.04437
C  -3.209576 -3.162669 0.154685
C  -3.580166 -1.958436 -2.023035
C  -3.241245 0.635043 -0.485505
C  -0.436713 -1.775225 0.234498
C  -3.813442 1.594657 0.231695
C  1.927563 -1.966655 0.303062
C  2.857398 -0.808828 0.073015
C  2.434965 0.489759 0.325878
C  4.150546 -0.984702 -0.393898
C  4.988235 0.096999 -0.609021
C  3.264721 1.570988 0.09737
C  4.550227 1.382017 -0.370187
H  -1.205621 -0.848228 -1.563675
H  -2.718957 -0.71472 1.125103
H  -2.781837 -3.121508 1.152319
H  -4.290598 -3.26839 0.257998
H  -2.835425 -4.063101 -0.335384
H  -3.293982 -1.124416 -2.662968
H  -3.328785 -2.875329 -2.557967
H  -4.664617 -1.927647 -1.906077
H  -3.149459 0.82107 -1.54829
H  2.371227 -2.895238 -0.052792
H  1.716851 -2.086094 1.366945
H  5.202521 2.22695 -0.542725
totalener: -2049.15073775 hartree
nucrepener: 2218.76320426 hartree
electener: -4267.91394201 hartree
oneelecener: -7233.81905368 hartree
twoeener: 2965.90511167 hartree
kineticenergy: 2043.57005563 hartree
xcener: -143.167107667115 hartree
chargesum: -0.0000000
charge: -0.039728 -0.047322 -0.183528 -0.188597 -0.181817 -0.180056 -0.275717 -0.379078 0.075874 -0.092938 0.047800 -0.248488 -0.245535 -0.206230 0.359638 0.054419 0.046193 -0.127909 0.225960 0.218380 0.191425 0.184542 -0.173204 0.076728 0.087461 0.104394 0.087600 0.084869 0.072715 0.093183 0.099609 0.094707 0.107204 0.124950 0.132496
qa: -0.0397 -0.0473 -0.1835 -0.1886 -0.1818 -0.1801 -0.2757 -0.3791 0.0759 -0.0929 0.0478 -0.2485 -0.2455 -0.2062 0.3596 0.0544 0.0462 -0.1279 0.2260 0.2184 0.1914 0.1845 -0.1732 0.0767 0.0875 0.1044 0.0876 0.0849 0.0727 0.0932 0.0996 0.0947 0.1072 0.1250 0.1325
va: 1.2877 1.2579 1.1227 1.1133 1.1136 1.1161 2.1129 2.1243 3.7583 3.8675 3.8188 3.9141 3.9103 3.9311 4.2207 4.2484 3.8695 3.6257 3.8818 3.9005 3.9906 4.0247 3.8731 1.0367 1.0510 1.0222 1.0013 1.0023 1.0098 1.0043 1.0026 1.0311 1.0085 1.0200 1.0077
dispcorr: -0.016332819 hartree
energy: -2049.167070570495
dipole: -20.25416 20.50770 0.25354 -25.87428 25.43012 -0.44416 -8.28527 7.45034 -0.83492
magnitude: 0.97911 au
magnitude: 2.48870 debye
