program: Orca
programVersion: 5.0.2
elementType: Cl Cl F F F F O O C C C C C C C C C C C C C C C H H H H H H H H H H H H
charge: 0
multiplicity: 1
keywords: wb97x-d3
keywords: def2-TZVPP
keywords: def2/J RIJCOSX
keywords: DEFGRID2
keywords: scfconv7
keywords: smallprint printgap noloewdin
keywords: NOSOSCF
formula: C15H12Cl2F4O2
InChI: InChI=1/C15H12Cl2F4O2/c1-15(2)7(3-10(16)17)11(15)14(22)23-5-6-12(20)8(18)4-9(19)13(6)21/h3-4,7,11H,5H2,1-2H3
35 atoms
Cl -4.244696 -1.86458 1.905051
Cl -5.367806 0.791951 1.90623
F  4.166926 0.083324 -2.214385
F  1.775901 -0.045697 1.825599
F  3.410038 1.835546 2.850681
F  5.797187 1.950641 -1.184589
O  0.770295 -0.456017 -1.014123
O  -0.254069 -2.443277 -1.008935
C  -2.640957 -0.853729 -2.24867
C  -1.525977 -0.436299 -1.314782
C  -2.844006 -0.963381 -0.767756
C  -2.554303 -2.13449 -3.043564
C  -3.303861 0.265804 -3.017133
C  -3.721313 -0.055403 -0.019865
C  -0.305965 -1.246467 -1.102959
C  -4.354282 -0.346926 1.110261
C  2.01646 -1.091814 -0.745187
C  2.939442 -0.039616 -0.210403
C  3.968985 0.498672 -0.965176
C  2.762263 0.441954 1.079707
C  3.598496 1.407952 1.60601
C  4.80954 1.465339 -0.438617
C  4.629229 1.927534 0.847953
H  -1.368123 0.633211 -1.23588
H  -2.782293 -1.973703 -0.379967
H  -2.138651 -2.961636 -2.475139
H  -3.553002 -2.422893 -3.375064
H  -1.938616 -1.995275 -3.93386
H  -4.34864 0.026492 -3.221133
H  -3.276388 1.222922 -2.497379
H  -2.802599 0.409631 -3.97526
H  -3.872024 0.944525 -0.407007
H  2.412378 -1.540541 -1.656473
H  1.89226 -1.89537 -0.017764
H  5.2849 2.683843 1.257295
totalener: -2049.15254531 hartree
nucrepener: 2182.06024849 hartree
electener: -4231.21279381 hartree
oneelecener: -7160.28265225 hartree
twoeener: 2929.06985844 hartree
kineticenergy: 2043.57537598 hartree
xcener: -143.166373476587 hartree
chargesum: -0.0000000
charge: -0.038662 -0.047088 -0.186436 -0.181930 -0.180817 -0.181712 -0.261192 -0.382970 0.079064 -0.077255 0.027861 -0.247606 -0.256628 -0.196142 0.350581 0.050445 0.052124 -0.192577 0.262795 0.244885 0.179450 0.170751 -0.161087 0.077668 0.087453 0.105190 0.087806 0.084759 0.100965 0.074413 0.093266 0.095955 0.112336 0.120708 0.133624
qa: -0.0387 -0.0471 -0.1864 -0.1819 -0.1808 -0.1817 -0.2612 -0.3830 0.0791 -0.0773 0.0279 -0.2476 -0.2566 -0.1961 0.3506 0.0504 0.0521 -0.1926 0.2628 0.2449 0.1794 0.1708 -0.1611 0.0777 0.0875 0.1052 0.0878 0.0848 0.1010 0.0744 0.0933 0.0960 0.1123 0.1207 0.1336
va: 1.2894 1.2581 1.1187 1.1237 1.1147 1.1133 2.1274 2.1165 3.7562 3.8737 3.8400 3.9126 3.9130 3.9217 4.2159 4.2575 3.8440 3.6903 3.8733 3.8956 4.0039 4.0000 3.8580 1.0340 1.0492 1.0221 1.0007 1.0024 1.0016 1.0095 1.0045 1.0324 1.0095 1.0069 1.0072
dispcorr: -0.015805622 hartree
energy: -2049.168350935752
dipole: -16.33994 16.64861 0.30867 -8.15961 8.76724 0.60763 -26.81320 26.07341 -0.73979
magnitude: 1.00587 au
magnitude: 2.55672 debye
