program: Orca
programVersion: 5.0.2
elementType: Cl Cl F F F F O O C C C C C C C C C C C C C C C H H H H H H H H H H H H
charge: 0
multiplicity: 1
keywords: wb97x-d3
keywords: def2-TZVPP
keywords: def2/J RIJCOSX
keywords: DEFGRID2
keywords: scfconv7
keywords: smallprint printgap noloewdin
keywords: NOSOSCF
formula: C15H12Cl2F4O2
InChI: InChI=1/C15H12Cl2F4O2/c1-15(2)7(3-10(16)17)11(15)14(22)23-5-6-12(20)8(18)4-9(19)13(6)21/h3-4,7,11H,5H2,1-2H3
35 atoms
Cl -5.730144 0.549232 0.698538
Cl -6.244281 -0.228638 -2.031462
F  4.116757 2.456618 -1.171185
F  2.143823 -1.03718 1.272661
F  4.382354 -2.501402 0.97756
F  6.357202 1.002785 -1.431381
O  0.738567 0.782114 -0.358469
O  -0.633572 1.312144 1.333419
C  -1.873124 -1.453672 0.456861
C  -1.324525 -0.271122 -0.317995
C  -2.773903 -0.304319 0.102106
C  -1.518545 -1.649962 1.910675
C  -1.986089 -2.753846 -0.302303
C  -3.817463 -0.419459 -0.92569
C  -0.409041 0.694785 0.329032
C  -5.089934 -0.077161 -0.766648
C  1.803357 1.531009 0.215662
C  3.067803 0.740501 0.047961
C  4.163888 1.237745 -0.637397
C  3.169473 -0.533205 0.590739
C  4.320297 -1.28391 0.44737
C  5.322182 0.490365 -0.773803
C  5.40728 -0.775798 -0.236068
H  -1.104331 -0.470372 -1.361199
H  -3.012774 0.350403 0.932474
H  -1.498105 -0.720378 2.473414
H  -2.253925 -2.305528 2.379599
H  -0.541283 -2.125693 2.008191
H  -1.064961 -3.329562 -0.200912
H  -2.802494 -3.358335 0.095729
H  -2.167713 -2.616263 -1.367655
H  -3.541565 -0.808549 -1.898062
H  1.612919 1.729531 1.271612
H  1.87344 2.493178 -0.290609
H  6.310788 -1.360215 -0.343918
totalener: -2049.15144046 hartree
nucrepener: 2188.12452856 hartree
electener: -4237.27596902 hartree
oneelecener: -7172.34882224 hartree
twoeener: 2935.07285322 hartree
kineticenergy: 2043.58639960 hartree
xcener: -143.169378160928 hartree
chargesum: -0.0000000
charge: -0.040131 -0.046691 -0.187046 -0.186976 -0.181810 -0.180932 -0.269474 -0.373061 0.069994 -0.083995 0.044075 -0.250297 -0.238218 -0.202920 0.341904 0.047857 0.041228 -0.138122 0.233991 0.223916 0.187240 0.187279 -0.172046 0.076774 0.088164 0.101509 0.090862 0.087353 0.095142 0.098860 0.070369 0.098159 0.126209 0.108058 0.132776
qa: -0.0401 -0.0467 -0.1870 -0.1870 -0.1818 -0.1809 -0.2695 -0.3731 0.0700 -0.0840 0.0441 -0.2503 -0.2382 -0.2029 0.3419 0.0479 0.0412 -0.1381 0.2340 0.2239 0.1872 0.1873 -0.1720 0.0768 0.0882 0.1015 0.0909 0.0874 0.0951 0.0989 0.0704 0.0982 0.1262 0.1081 0.1328
va: 1.2871 1.2589 1.1163 1.1172 1.1136 1.1148 2.1163 2.1298 3.7722 3.8805 3.8216 3.9107 3.9040 3.9124 4.2440 4.2435 3.8601 3.6388 3.8985 3.8851 4.0141 3.9951 3.8717 1.0361 1.0497 1.0208 1.0024 1.0079 1.0046 1.0035 1.0092 1.0275 1.0174 1.0108 1.0074
dispcorr: -0.016709733 hartree
energy: -2049.168150188468
dipole: -7.27535 8.17464 0.89930 -11.71415 11.02629 -0.68785 6.03450 -6.34523 -0.31073
magnitude: 1.17406 au
magnitude: 2.98423 debye
