program: Orca
programVersion: 5.0.2
elementType: Cl Cl F F F F O O C C C C C C C C C C C C C C C H H H H H H H H H H H H
charge: 0
multiplicity: 1
keywords: wb97x-d3
keywords: def2-TZVPP
keywords: def2/J RIJCOSX
keywords: DEFGRID2
keywords: scfconv7
keywords: smallprint printgap noloewdin
keywords: NOSOSCF
formula: C15H12Cl2F4O2
InChI: InChI=1/C15H12Cl2F4O2/c1-15(2)7(3-10(16)17)11(15)14(22)23-5-6-12(20)8(18)4-9(19)13(6)21/h3-4,7,11H,5H2,1-2H3
35 atoms
Cl -3.942281 1.401783 -1.27905
Cl -6.300851 -0.066593 -0.4996
F  2.796006 2.339037 0.510653
F  2.527785 -1.624268 -2.003723
F  4.179204 -2.833486 -0.262833
F  4.418582 1.121089 2.250213
O  0.331231 0.291628 -1.588829
O  0.019915 1.183184 0.436485
C  -1.50854 -1.563424 0.75855
C  -1.457745 -0.522585 -0.3505
C  -2.437919 -0.391494 0.780631
C  -0.40778 -1.647226 1.787765
C  -2.049785 -2.913378 0.3536
C  -3.889256 -0.56002 0.548353
C  -0.321674 0.420359 -0.426097
C  -4.609527 0.161935 -0.299187
C  1.569191 0.986097 -1.7003
C  2.591186 0.379703 -0.777943
C  3.107492 1.065864 0.310105
C  2.9815 -0.940977 -0.955962
C  3.835454 -1.563229 -0.065313
C  3.96086 0.440963 1.203768
C  4.328317 -0.876143 1.025669
H  -1.837599 -0.85754 -1.308778
H  -2.184407 0.383083 1.500644
H  -0.059664 -0.67209 2.119978
H  -0.766338 -2.186504 2.666271
H  0.450039 -2.196464 1.394176
H  -2.466843 -3.436249 1.216749
H  -2.832965 -2.841186 -0.401365
H  -1.253216 -3.537047 -0.054188
H  -4.415149 -1.304097 1.135725
H  1.444625 2.049557 -1.499471
H  1.866494 0.870372 -2.741187
H  4.995764 -1.360645 1.725102
totalener: -2049.14892755 hartree
nucrepener: 2293.55982752 hartree
electener: -4342.70875507 hartree
oneelecener: -7383.61188147 hartree
twoeener: 3040.90312640 hartree
kineticenergy: 2043.59309624 hartree
xcener: -143.170077985150 hartree
chargesum: 0.0000000
charge: -0.032173 -0.042821 -0.177791 -0.181845 -0.185454 -0.182415 -0.256373 -0.373809 0.116957 -0.156419 0.006046 -0.264699 -0.270908 -0.257894 0.358541 0.094978 0.063428 -0.204931 0.296891 0.197689 0.182582 0.181157 -0.173982 0.104496 0.107332 0.102090 0.090543 0.087885 0.092403 0.088353 0.098438 0.117795 0.118033 0.123419 0.132457
qa: -0.0322 -0.0428 -0.1778 -0.1818 -0.1855 -0.1824 -0.2564 -0.3738 0.1170 -0.1564 0.0060 -0.2647 -0.2709 -0.2579 0.3585 0.0950 0.0634 -0.2049 0.2969 0.1977 0.1826 0.1812 -0.1740 0.1045 0.1073 0.1021 0.0905 0.0879 0.0924 0.0884 0.0984 0.1178 0.1180 0.1234 0.1325
va: 1.2979 1.2625 1.1302 1.1222 1.1074 1.1135 2.1310 2.1278 3.7322 3.8710 3.8202 3.9036 3.9100 3.9119 4.1982 4.2060 3.8641 3.6312 3.8423 3.9358 3.9656 3.9997 3.8697 1.0252 1.0277 1.0181 1.0055 0.9986 1.0017 1.0006 1.0057 1.0179 1.0174 0.9935 1.0076
dispcorr: -0.019029687 hartree
energy: -2049.167957238796
dipole: -5.34844 5.61138 0.26293 -14.29476 13.50651 -0.78825 7.83750 -7.82688 0.01062
magnitude: 0.83102 au
magnitude: 2.11228 debye
