program: Orca
programVersion: 5.0.2
elementType: Br Br Br Br O O O N C C C C C C C C C C C C C C C C C C C C C C H H H H H H H H H H H H H H H H H H H
charge: 0
multiplicity: 1
keywords: wb97x-d3
keywords: def2-TZVPP
keywords: def2/J RIJCOSX
keywords: DEFGRID2
keywords: scfconv7
keywords: smallprint printgap noloewdin
keywords: NOSOSCF
formula: C22H19Br4NO3
InChI: InChI=1/C22H19Br4NO3/c1-21(2)17(19(23)22(24,25)26)18(21)20(28)30-16(12-27)13-7-6-10-15(11-13)29-14-8-4-3-5-9-14/h3-11,16-19H,1-2H3
49 atoms
Br 4.062721 -1.648419 -0.813425
Br 3.25438 -0.158413 2.186631
Br 0.776265 -2.067123 2.44414
Br 3.643974 -3.281077 2.176104
O  -2.314278 -0.811709 -0.210704
O  -0.942691 0.939526 0.008017
O  -5.094066 4.34664 -1.179354
N  -5.416395 -1.574637 0.633743
C  0.823888 -0.921505 -1.878747
C  1.37617 -0.84863 -0.490996
C  -0.079536 -1.188331 -0.685116
C  2.317896 -1.880102 0.057476
C  1.09049 -2.116066 -2.76198
C  0.718218 0.369106 -2.651974
C  -1.106788 -0.223692 -0.259574
C  2.502707 -1.833134 1.583112
C  -3.40749 0.022381 0.1402
C  -3.806774 0.977671 -0.96164
C  -4.517522 -0.891242 0.415335
C  -4.217075 2.254617 -0.616214
C  -3.802978 0.568167 -2.28971
C  -4.649929 3.128325 -1.605865
C  -4.223914 1.456969 -3.266219
C  -4.657397 2.73385 -2.937559
C  -5.075258 5.426613 -2.032458
C  -6.245572 6.155667 -2.170581
C  -3.909116 5.81493 -2.679159
C  -6.246609 7.29434 -2.965351
C  -3.927666 6.947567 -3.47951
C  -5.092367 7.690531 -3.626043
H  1.569057 0.163754 -0.150215
H  -0.366179 -2.228127 -0.573767
H  1.983015 -2.889469 -0.197143
H  2.024818 -1.990791 -3.30965
H  1.141016 -3.056295 -2.213539
H  0.289204 -2.213559 -3.495891
H  1.628846 0.515114 -3.234752
H  -0.119718 0.333929 -3.350012
H  0.596208 1.243541 -2.016908
H  -3.202357 0.573194 1.064538
H  -4.209168 2.573285 0.419266
H  -3.483424 -0.42806 -2.566264
H  -4.229122 1.150457 -4.303556
H  -4.998006 3.401211 -3.718081
H  -7.144262 5.839932 -1.656179
H  -2.995577 5.246015 -2.558944
H  -7.158235 7.867457 -3.07112
H  -3.021583 7.253478 -3.985662
H  -5.097987 8.575263 -4.248419
elementType: Br O N C H
nucrepener: 5418.50218298 hartree
twoeener: 9822.01559948 hartree
cpcmener: -0.03728374 hartree
xcener: -389.799395240978 hartree
chargesum: -0.0000000
charge: -0.082451 -0.013688 -0.011909 -0.002238 -0.278597 -0.450512 -0.334066 -0.099987 0.097959 -0.087958 -0.145387 -0.155955 -0.261430 -0.262313 0.396102 0.036341 0.418276 0.022915 -0.219661 -0.240311 -0.231114 0.280269 -0.145364 -0.178790 0.265664 -0.232784 -0.187735 -0.132405 -0.147502 -0.177361 0.117275 0.120986 0.169747 0.097496 0.094172 0.109516 0.101638 0.102168 0.095854 0.146453 0.136433 0.150026 0.163463 0.158579 0.149626 0.161847 0.161374 0.163345 0.161995
qa: -0.0825 -0.0137 -0.0119 -0.0022 -0.2786 -0.4505 -0.3341 -0.1000 0.0980 -0.0880 -0.1454 -0.1560 -0.2614 -0.2623 0.3961 0.0363 0.4183 0.0229 -0.2197 -0.2403 -0.2311 0.2803 -0.1454 -0.1788 0.2657 -0.2328 -0.1877 -0.1324 -0.1475 -0.1774 0.1173 0.1210 0.1697 0.0975 0.0942 0.1095 0.1016 0.1022 0.0959 0.1465 0.1364 0.1500 0.1635 0.1586 0.1496 0.1618 0.1614 0.1633 0.1620
va: 1.1823 1.2217 1.2264 1.2299 2.1229 2.0581 2.0671 3.1114 3.8680 3.7456 3.8681 4.0632 3.8992 3.8983 4.1490 4.3534 3.6965 3.6279 4.0815 4.0882 3.9543 3.7509 3.9211 3.8970 3.6805 4.0052 3.9251 3.8803 3.8821 3.8909 1.0453 1.0243 0.9933 1.0063 1.0035 1.0023 1.0033 1.0011 1.0166 1.0173 1.0183 1.0122 0.9898 0.9960 1.0058 0.9945 0.9883 0.9887 0.9890
dispcorr: -0.028994319 hartree
energy: -11427.158790479469
dipole: -143.16105 143.72453 0.56348 96.49859 -95.94496 0.55363 -96.16976 93.92745 -2.24230
magnitude: 2.37738 au
magnitude: 6.04282 debye
