program: Orca
programVersion: 5.0.2
elementType: Br Br Br Br O O O N C C C C C C C C C C C C C C C C C C C C C C H H H H H H H H H H H H H H H H H H H
charge: 0
multiplicity: 1
keywords: wb97x-d3
keywords: def2-TZVPP
keywords: def2/J RIJCOSX
keywords: DEFGRID2
keywords: scfconv7
keywords: smallprint printgap noloewdin
keywords: NOSOSCF
formula: C22H19Br4NO3
InChI: InChI=1/C22H19Br4NO3/c1-21(2)17(19(23)22(24,25)26)18(21)20(28)30-16(12-27)13-7-6-10-15(11-13)29-14-8-4-3-5-9-14/h3-11,16-19H,1-2H3
49 atoms
Br 3.118747 -3.26542 -0.883541
Br 3.876434 0.057073 -0.34163
Br 2.032415 0.033798 2.195165
Br 4.438146 -1.950589 2.015462
O  -2.073795 0.045997 1.044672
O  -0.944329 0.720248 -0.762415
O  -5.601147 2.977858 -2.819212
N  -4.291643 1.337395 3.121528
C  -0.252344 -2.384932 -0.779947
C  0.935324 -1.557484 -0.398832
C  -0.370864 -1.341763 0.320409
C  2.102923 -2.127799 0.351147
C  -0.382765 -3.818593 -0.325376
C  -0.867923 -2.140569 -2.135651
C  -1.114889 -0.08978 0.112841
C  3.048571 -1.087913 0.976351
C  -2.949445 1.151309 0.887012
C  -3.921309 0.967943 -0.257114
C  -3.68614 1.241409 2.148411
C  -4.282132 2.079074 -1.003754
C  -4.462905 -0.282287 -0.528943
C  -5.217969 1.93729 -2.020998
C  -5.371471 -0.410684 -1.568325
C  -5.760661 0.693337 -2.311059
C  -5.68459 4.252409 -2.311184
C  -5.241461 5.283456 -3.126146
C  -6.244757 4.517699 -1.067717
C  -5.358853 6.595646 -2.689537
C  -6.342315 5.833644 -0.638876
C  -5.902054 6.876353 -1.443646
H  1.192841 -0.796044 -1.128241
H  -0.465859 -1.763431 1.314646
H  1.763165 -2.786762 1.154867
H  -1.437111 -4.096874 -0.292164
H  0.113242 -4.491983 -1.024986
H  0.028197 -3.996529 0.668075
H  -0.69542 -1.134732 -2.511668
H  -0.43905 -2.836493 -2.858136
H  -1.944865 -2.314991 -2.106579
H  -2.392135 2.086129 0.767302
H  -3.831902 3.040593 -0.788617
H  -4.18606 -1.149731 0.055589
H  -5.794622 -1.379841 -1.795251
H  -6.479793 0.592096 -3.113659
H  -4.813993 5.060727 -4.095437
H  -6.603407 3.714972 -0.435986
H  -5.016349 7.399659 -3.327423
H  -6.773767 6.041668 0.331378
H  -5.985331 7.899576 -1.102812
elementType: Br O N C H
nucrepener: 5450.49710641 hartree
twoeener: 9853.93507366 hartree
cpcmener: -0.03721814 hartree
xcener: -389.799785033425 hartree
chargesum: 0.0000000
charge: -0.082932 -0.012188 -0.012645 -0.001800 -0.276587 -0.449165 -0.336598 -0.099787 0.102132 -0.081303 -0.143182 -0.166077 -0.264605 -0.265199 0.386803 0.036243 0.420554 0.025494 -0.221206 -0.200268 -0.239044 0.282557 -0.123527 -0.229103 0.294760 -0.256158 -0.201547 -0.121201 -0.141680 -0.191582 0.118170 0.121284 0.171376 0.109292 0.099164 0.094547 0.096814 0.103094 0.102156 0.144310 0.146701 0.151761 0.162728 0.151311 0.149078 0.160224 0.162005 0.163081 0.161740
qa: -0.0829 -0.0122 -0.0126 -0.0018 -0.2766 -0.4492 -0.3366 -0.0998 0.1021 -0.0813 -0.1432 -0.1661 -0.2646 -0.2652 0.3868 0.0362 0.4206 0.0255 -0.2212 -0.2003 -0.2390 0.2826 -0.1235 -0.2291 0.2948 -0.2562 -0.2015 -0.1212 -0.1417 -0.1916 0.1182 0.1213 0.1714 0.1093 0.0992 0.0945 0.0968 0.1031 0.1022 0.1443 0.1467 0.1518 0.1627 0.1513 0.1491 0.1602 0.1620 0.1631 0.1617
va: 1.1821 1.2219 1.2255 1.2294 2.1199 2.0597 2.0719 3.1107 3.8617 3.7447 3.8563 4.0663 3.8986 3.8978 4.1647 4.3516 3.7007 3.6039 4.0815 3.9826 3.9441 3.7177 3.9039 4.0043 3.6693 4.0125 3.9156 3.8750 3.8808 3.9034 1.0435 1.0238 0.9918 1.0028 1.0056 1.0036 1.0161 1.0036 1.0010 1.0193 1.0051 1.0112 0.9879 1.0041 1.0073 0.9959 0.9878 0.9889 0.9894
dispcorr: -0.029458285 hartree
energy: -11427.159013327495
dipole: -175.18359 174.72461 -0.45899 55.96835 -56.89308 -0.92473 -46.56376 45.83800 -0.72576
magnitude: 1.26195 au
magnitude: 3.20762 debye
