program: Orca
programVersion: 5.0.2
elementType: Br Br Br Br O O O N C C C C C C C C C C C C C C C C C C C C C C H H H H H H H H H H H H H H H H H H H
charge: 0
multiplicity: 1
keywords: wb97x-d3
keywords: def2-TZVPP
keywords: def2/J RIJCOSX
keywords: DEFGRID2
keywords: scfconv7
keywords: smallprint printgap noloewdin
keywords: NOSOSCF
formula: C22H19Br4NO3
InChI: InChI=1/C22H19Br4NO3/c1-21(2)17(19(23)22(24,25)26)18(21)20(28)30-16(12-27)13-7-6-10-15(11-13)29-14-8-4-3-5-9-14/h3-11,16-19H,1-2H3
49 atoms
Br 3.648563 -0.457269 -0.351621
Br 0.838021 1.465997 0.094982
Br -0.303137 -0.657585 2.098927
Br 2.46142 0.689514 2.673711
O  -1.532583 -2.33927 -1.297116
O  -1.809342 -3.766863 0.401013
O  -2.528416 2.712505 -0.165076
N  -3.509233 -1.52247 -3.819972
C  1.47356 -3.114579 -1.161505
C  1.157182 -1.806783 -0.511884
C  0.379498 -3.042585 -0.112686
C  2.023498 -1.14035 0.514212
C  2.694423 -3.904528 -0.752533
C  1.149966 -3.258939 -2.627626
C  -1.079988 -3.112255 -0.302241
C  1.321642 0.005917 1.264281
C  -2.929515 -2.057054 -1.329682
C  -3.237343 -0.880759 -0.436701
C  -3.23814 -1.761248 -2.72836
C  -2.729953 0.372164 -0.765112
C  -3.961636 -1.071298 0.729687
C  -2.991022 1.448918 0.068096
C  -4.190695 0.011917 1.56826
C  -3.718799 1.270287 1.239319
C  -2.252977 3.15316 -1.434687
C  -3.081837 2.880133 -2.516469
C  -1.132536 3.958097 -1.589153
C  -2.758487 3.394208 -3.763844
C  -0.826242 4.472341 -2.84156
C  -1.629553 4.184377 -3.935674
H  0.628554 -1.118582 -1.162921
H  0.66472 -3.496432 0.829906
H  2.364893 -1.861378 1.261108
H  3.570408 -3.571996 -1.309971
H  2.920591 -3.828734 0.310866
H  2.542088 -4.961249 -0.97698
H  0.929628 -4.299463 -2.870648
H  0.30888 -2.648886 -2.948517
H  2.015697 -2.95762 -3.219488
H  -3.525028 -2.927907 -1.041278
H  -2.145686 0.499977 -1.668255
H  -4.346849 -2.050676 0.980943
H  -4.753494 -0.122834 2.48204
H  -3.909435 2.116154 1.887469
H  -3.972109 2.276087 -2.397209
H  -0.518274 4.205017 -0.732173
H  -3.40222 3.176516 -4.605887
H  0.048409 5.098593 -2.957782
H  -1.384839 4.580067 -4.912171
elementType: Br O N C H
nucrepener: 6073.10462263 hartree
cpcmener: -0.03411716 hartree
xcener: -389.805975809443 hartree
chargesum: -0.0000000
charge: -0.085428 -0.026333 -0.015918 -0.011675 -0.272179 -0.450106 -0.322218 -0.100482 0.100578 -0.103098 -0.112677 -0.160676 -0.267366 -0.259629 0.373849 0.084412 0.414981 0.031041 -0.228446 -0.256706 -0.200976 0.315213 -0.107992 -0.254862 0.322481 -0.223101 -0.287984 -0.132912 -0.114623 -0.195400 0.122108 0.118430 0.167899 0.099182 0.093977 0.108598 0.103456 0.092510 0.097689 0.141283 0.142672 0.146508 0.160420 0.147527 0.158650 0.161272 0.163550 0.161244 0.161256
qa: -0.0854 -0.0263 -0.0159 -0.0117 -0.2722 -0.4501 -0.3222 -0.1005 0.1006 -0.1031 -0.1127 -0.1607 -0.2674 -0.2596 0.3738 0.0844 0.4150 0.0310 -0.2284 -0.2567 -0.2010 0.3152 -0.1080 -0.2549 0.3225 -0.2231 -0.2880 -0.1329 -0.1146 -0.1954 0.1221 0.1184 0.1679 0.0992 0.0940 0.1086 0.1035 0.0925 0.0977 0.1413 0.1427 0.1465 0.1604 0.1475 0.1587 0.1613 0.1636 0.1612 0.1613
va: 1.1796 1.2292 1.2329 1.2239 2.1202 2.0461 2.0715 3.1010 3.8877 3.7127 3.8654 4.0627 3.9037 3.9009 4.1741 4.2905 3.7398 3.6068 4.0737 3.9347 3.9438 3.6553 3.8797 4.0252 3.6409 3.9229 3.9788 3.8692 3.9014 3.9216 1.0336 1.0226 0.9924 1.0052 1.0038 1.0028 1.0009 1.0132 1.0017 1.0177 1.0111 1.0083 0.9882 1.0060 0.9974 1.0039 0.9883 0.9893 0.9894
dispcorr: -0.036146803 hartree
energy: -11427.162389726056
dipole: -72.42678 72.98376 0.55698 -21.00794 20.43170 -0.57624 -63.31084 63.81476 0.50392
magnitude: 0.94669 au
magnitude: 2.40629 debye
