program: Orca
programVersion: 5.0.2
elementType: Br Br Br Br O O O N C C C C C C C C C C C C C C C C C C C C C C H H H H H H H H H H H H H H H H H H H
charge: 0
multiplicity: 1
keywords: wb97x-d3
keywords: def2-TZVPP
keywords: def2/J RIJCOSX
keywords: DEFGRID2
keywords: scfconv7
keywords: smallprint printgap noloewdin
keywords: NOSOSCF
formula: C22H19Br4NO3
InChI: InChI=1/C22H19Br4NO3/c1-21(2)17(19(23)22(24,25)26)18(21)20(28)30-16(12-27)13-7-6-10-15(11-13)29-14-8-4-3-5-9-14/h3-11,16-19H,1-2H3
49 atoms
Br 3.52106 -2.296257 -1.089252
Br 3.437815 0.822181 0.38175
Br 1.453415 -0.272887 2.546769
Br 4.260121 -1.610513 2.194861
O  -2.497951 -0.862211 0.807398
O  -1.317549 0.630059 -0.366349
O  -5.696303 2.797906 -2.652088
N  -5.291263 -0.922071 2.565344
C  0.030049 -2.151798 -1.244568
C  0.959911 -1.260789 -0.480226
C  -0.408716 -1.54404 0.077754
C  2.170846 -1.778724 0.238406
C  0.204449 -3.65075 -1.244541
C  -0.525086 -1.623417 -2.543959
C  -1.408672 -0.464161 0.12921
C  2.793223 -0.786756 1.235319
C  -3.588328 0.048347 0.837289
C  -4.257665 0.192496 -0.511036
C  -4.529176 -0.511809 1.807952
C  -4.638046 1.456673 -0.936228
C  -4.49297 -0.928165 -1.297242
C  -5.251695 1.598956 -2.174388
C  -5.107489 -0.767685 -2.529878
C  -5.483499 0.489079 -2.976354
C  -5.109747 3.97739 -2.25722
C  -5.956863 5.01921 -1.910858
C  -3.731483 4.151314 -2.268355
C  -5.416808 6.253028 -1.574544
C  -3.205541 5.386126 -1.916615
C  -4.041643 6.439833 -1.569856
H  1.084003 -0.277289 -0.922336
H  -0.47701 -2.261265 0.888294
H  1.933515 -2.689885 0.794531
H  0.895616 -3.958972 -2.029454
H  0.569092 -4.0435 -0.295755
H  -0.755034 -4.130064 -1.444233
H  -0.582303 -0.537247 -2.577499
H  0.113744 -1.941678 -3.369115
H  -1.524825 -2.021784 -2.725669
H  -3.274437 1.027497 1.213525
H  -4.451385 2.31351 -0.300678
H  -4.202267 -1.915369 -0.962108
H  -5.292613 -1.63056 -3.155195
H  -5.958629 0.611363 -3.94121
H  -7.028814 4.867718 -1.911933
H  -3.071433 3.33959 -2.547702
H  -6.077821 7.06749 -1.30882
H  -2.132284 5.523906 -1.921118
H  -3.623376 7.400504 -1.300964
elementType: Br O N C H
nucrepener: 5515.86226161 hartree
twoeener: 9919.21221517 hartree
cpcmener: -0.03702862 hartree
xcener: -389.799366502839 hartree
chargesum: -0.0000000
charge: -0.083126 -0.013660 -0.012358 -0.002646 -0.273043 -0.448076 -0.334649 -0.099950 0.106615 -0.085747 -0.147158 -0.157322 -0.264246 -0.267512 0.388992 0.036549 0.418713 0.017385 -0.219317 -0.200053 -0.259229 0.301837 -0.114116 -0.234607 0.291812 -0.248702 -0.203950 -0.123457 -0.140975 -0.187477 0.116018 0.122192 0.167179 0.099173 0.093615 0.109454 0.096632 0.104685 0.102001 0.144571 0.144444 0.151190 0.162196 0.150912 0.148781 0.160133 0.161924 0.162572 0.161800
qa: -0.0831 -0.0137 -0.0124 -0.0026 -0.2730 -0.4481 -0.3346 -0.1000 0.1066 -0.0857 -0.1472 -0.1573 -0.2642 -0.2675 0.3890 0.0365 0.4187 0.0174 -0.2193 -0.2001 -0.2592 0.3018 -0.1141 -0.2346 0.2918 -0.2487 -0.2039 -0.1235 -0.1410 -0.1875 0.1160 0.1222 0.1672 0.0992 0.0936 0.1095 0.0966 0.1047 0.1020 0.1446 0.1444 0.1512 0.1622 0.1509 0.1488 0.1601 0.1619 0.1626 0.1618
va: 1.1812 1.2223 1.2267 1.2297 2.1270 2.0573 2.0756 3.1109 3.8623 3.7455 3.8559 4.0617 3.8963 3.8981 4.1664 4.3572 3.6999 3.6057 4.0834 3.9613 3.9519 3.7069 3.8983 4.0017 3.6686 4.0143 3.9242 3.8741 3.8799 3.9011 1.0452 1.0236 0.9936 1.0051 1.0035 1.0030 1.0144 1.0037 1.0015 1.0177 1.0067 1.0110 0.9878 1.0048 1.0070 0.9975 0.9879 0.9890 0.9892
dispcorr: -0.029875138 hartree
energy: -11427.159397555743
dipole: -158.70538 159.10353 0.39815 37.57512 -38.04790 -0.47278 -63.07277 61.91746 -1.15532
magnitude: 1.31027 au
magnitude: 3.33043 debye
