program: Orca
programVersion: 5.0.2
elementType: Br Br Br Br O O O N C C C C C C C C C C C C C C C C C C C C C C H H H H H H H H H H H H H H H H H H H
charge: 0
multiplicity: 1
keywords: wb97x-d3
keywords: def2-TZVPP
keywords: def2/J RIJCOSX
keywords: DEFGRID2
keywords: scfconv7
keywords: smallprint printgap noloewdin
keywords: NOSOSCF
formula: C22H19Br4NO3
InChI: InChI=1/C22H19Br4NO3/c1-21(2)17(19(23)22(24,25)26)18(21)20(28)30-16(12-27)13-7-6-10-15(11-13)29-14-8-4-3-5-9-14/h3-11,16-19H,1-2H3
49 atoms
Br 3.424077 -2.127294 -1.378602
Br 3.327409 0.911176 0.26706
Br 1.531566 -0.383104 2.489798
Br 4.347827 -1.58791 1.871418
O  -2.53025 -0.991437 0.890349
O  -1.436161 0.614371 -0.216159
O  -5.588874 2.866411 -2.368973
N  -5.279698 -1.251249 2.714594
C  -0.060521 -2.053607 -1.354403
C  0.878245 -1.194603 -0.567077
C  -0.455171 -1.558959 0.028513
C  2.139542 -1.722548 0.04986
C  0.154039 -3.542133 -1.475065
C  -0.679125 -1.44365 -2.587124
C  -1.479899 -0.514794 0.201555
C  2.793471 -0.767292 1.061331
C  -3.647288 -0.119451 1.017336
C  -4.347687 0.105431 -0.302606
C  -4.547625 -0.774488 1.966822
C  -4.643484 1.402837 -0.690014
C  -4.66734 -0.974621 -1.116071
C  -5.244567 1.622471 -1.922549
C  -5.280982 -0.739108 -2.33654
C  -5.563435 0.553956 -2.749594
C  -4.874353 3.978959 -1.994124
C  -3.486262 3.987089 -1.925744
C  -5.604637 5.132046 -1.745258
C  -2.834905 5.165219 -1.588735
C  -4.938078 6.305838 -1.423746
C  -3.5531 6.326585 -1.336315
H  0.952719 -0.178371 -0.94064
H  -0.468373 -2.33526 0.785767
H  1.958111 -2.669868 0.565197
H  0.818322 -3.769987 -2.308968
H  0.571289 -3.991781 -0.574258
H  -0.799698 -4.03457 -1.670161
H  -0.058406 -1.671585 -3.454901
H  -1.670863 -1.861345 -2.769049
H  -0.772087 -0.360992 -2.530038
H  -3.349755 0.83749 1.45874
H  -4.393221 2.226828 -0.033786
H  -4.441507 -1.987894 -0.808842
H  -5.533995 -1.569803 -2.981254
H  -6.031199 0.735121 -3.708788
H  -2.910984 3.091602 -2.125785
H  -6.685155 5.111109 -1.808522
H  -1.754561 5.171249 -1.528688
H  -5.509403 7.204801 -1.233022
H  -3.036559 7.240716 -1.076139
elementType: Br O N C H
nucrepener: 5543.38775500 hartree
twoeener: 9946.68650368 hartree
cpcmener: -0.03642904 hartree
xcener: -389.800923110754 hartree
chargesum: 0.0000000
charge: -0.084134 -0.013693 -0.013069 -0.002353 -0.272358 -0.449627 -0.334389 -0.099784 0.102441 -0.086894 -0.146870 -0.153731 -0.264811 -0.263704 0.394640 0.036407 0.417773 0.028845 -0.219024 -0.221468 -0.261730 0.316802 -0.110731 -0.238737 0.312080 -0.214713 -0.261447 -0.139899 -0.117849 -0.193332 0.114902 0.121655 0.168180 0.098848 0.093977 0.109358 0.103915 0.101596 0.095480 0.143512 0.149041 0.149254 0.162547 0.150946 0.159234 0.147954 0.162421 0.161286 0.161256
qa: -0.0841 -0.0137 -0.0131 -0.0024 -0.2724 -0.4496 -0.3344 -0.0998 0.1024 -0.0869 -0.1469 -0.1537 -0.2648 -0.2637 0.3946 0.0364 0.4178 0.0288 -0.2190 -0.2215 -0.2617 0.3168 -0.1107 -0.2387 0.3121 -0.2147 -0.2614 -0.1399 -0.1178 -0.1933 0.1149 0.1217 0.1682 0.0988 0.0940 0.1094 0.1039 0.1016 0.0955 0.1435 0.1490 0.1493 0.1625 0.1509 0.1592 0.1480 0.1624 0.1613 0.1613
va: 1.1801 1.2220 1.2250 1.2299 2.1327 2.0550 2.0804 3.1104 3.8666 3.7454 3.8596 4.0585 3.8961 3.8999 4.1612 4.3601 3.7104 3.5757 4.0810 3.9553 3.9618 3.6942 3.8896 4.0075 3.6571 3.9155 4.0142 3.8808 3.8708 3.9078 1.0465 1.0238 0.9935 1.0051 1.0031 1.0031 1.0040 1.0017 1.0138 1.0170 1.0040 1.0115 0.9877 1.0048 0.9989 1.0079 0.9891 0.9879 0.9894
dispcorr: -0.030117110 hartree
energy: -11427.159324746928
dipole: -157.34919 157.75942 0.41023 36.51640 -36.97818 -0.46177 -55.44993 54.25164 -1.19829
magnitude: 1.34811 au
magnitude: 3.42663 debye
