program: Orca
programVersion: 5.0.2
elementType: Br Br Br Br O O O N C C C C C C C C C C C C C C C C C C C C C C H H H H H H H H H H H H H H H H H H H
charge: 0
multiplicity: 1
keywords: wb97x-d3
keywords: def2-TZVPP
keywords: def2/J RIJCOSX
keywords: DEFGRID2
keywords: scfconv7
keywords: smallprint printgap noloewdin
keywords: NOSOSCF
formula: C22H19Br4NO3
InChI: InChI=1/C22H19Br4NO3/c1-21(2)17(19(23)22(24,25)26)18(21)20(28)30-16(12-27)13-7-6-10-15(11-13)29-14-8-4-3-5-9-14/h3-11,16-19H,1-2H3
49 atoms
Br 3.470174 -1.782423 -1.437552
Br 3.218484 0.936779 0.683848
Br 1.452173 -0.784445 2.621714
Br 4.337032 -1.739699 1.893603
O  -2.532276 -1.084696 0.872542
O  -1.468851 0.607217 -0.130291
O  -5.608766 2.813396 -2.269594
N  -5.245694 -1.502321 2.712573
C  -0.018945 -1.923027 -1.432871
C  0.889464 -1.118192 -0.555974
C  -0.4471 -1.557649 -0.020112
C  2.157766 -1.676261 0.018717
C  0.225717 -3.39325 -1.671424
C  -0.63539 -1.229414 -2.622152
C  -1.491337 -0.546265 0.21705
C  2.757243 -0.870411 1.184576
C  -3.669526 -0.246463 1.049348
C  -4.393187 0.008111 -0.252075
C  -4.538002 -0.966484 1.981283
C  -4.662248 1.314532 -0.628458
C  -4.761133 -1.05851 -1.064045
C  -5.290271 1.554158 -1.843943
C  -5.402245 -0.802668 -2.265583
C  -5.661869 0.499842 -2.665616
C  -4.784503 3.875829 -1.986036
C  -3.39954 3.781722 -2.053805
C  -5.400881 5.082123 -1.687074
C  -2.634288 4.912742 -1.80702
C  -4.622216 6.207067 -1.455333
C  -3.237589 6.127273 -1.5080
H  0.946897 -0.070592 -0.834227
H  -0.466711 -2.398109 0.664584
H  2.012985 -2.700911 0.371849
H  0.612792 -3.91452 -0.796043
H  -0.712158 -3.879397 -1.944426
H  0.924472 -3.541617 -2.495209
H  -1.627739 -1.63329 -2.831099
H  -0.726773 -0.152908 -2.494245
H  -0.016295 -1.400301 -3.503965
H  -3.391768 0.700297 1.524311
H  -4.374198 2.131481 0.021387
H  -4.554522 -2.078773 -0.765889
H  -5.695137 -1.623661 -2.905797
H  -6.151893 0.698158 -3.610197
H  -2.913747 2.843859 -2.293346
H  -6.480948 5.140119 -1.641521
H  -1.555788 4.840282 -1.856496
H  -5.104946 7.147669 -1.224781
H  -2.632987 7.004265 -1.31995
elementType: Br O N C H
nucrepener: 5551.99931693 hartree
twoeener: 9955.30908583 hartree
cpcmener: -0.03616675 hartree
xcener: -389.798626066486 hartree
chargesum: -0.0000000
charge: -0.084576 -0.012582 -0.012905 -0.001783 -0.271311 -0.451250 -0.337035 -0.099878 0.100916 -0.088077 -0.147845 -0.154957 -0.266444 -0.260139 0.394415 0.034051 0.419395 0.029086 -0.219221 -0.205684 -0.254473 0.293747 -0.117432 -0.230745 0.296220 -0.197238 -0.257047 -0.147534 -0.121923 -0.189418 0.117491 0.122978 0.170990 0.095279 0.109353 0.098590 0.102910 0.093021 0.102338 0.142765 0.149440 0.148693 0.162944 0.151402 0.160808 0.148344 0.161679 0.161483 0.161158
qa: -0.0846 -0.0126 -0.0129 -0.0018 -0.2713 -0.4512 -0.3370 -0.0999 0.1009 -0.0881 -0.1478 -0.1550 -0.2664 -0.2601 0.3944 0.0341 0.4194 0.0291 -0.2192 -0.2057 -0.2545 0.2937 -0.1174 -0.2307 0.2962 -0.1972 -0.2570 -0.1475 -0.1219 -0.1894 0.1175 0.1230 0.1710 0.0953 0.1094 0.0986 0.1029 0.0930 0.1023 0.1428 0.1494 0.1487 0.1629 0.1514 0.1608 0.1483 0.1617 0.1615 0.1612
va: 1.1807 1.2216 1.2248 1.2295 2.1348 2.0563 2.0739 3.1102 3.8691 3.7445 3.8642 4.0535 3.8969 3.9020 4.1677 4.3526 3.7124 3.5657 4.0807 3.9434 3.9643 3.7100 3.8938 4.0112 3.6737 3.9039 4.0096 3.8894 3.8754 3.9035 1.0433 1.0221 0.9925 1.0038 1.0023 1.0056 1.0007 1.0141 1.0038 1.0171 1.0050 1.0113 0.9877 1.0041 0.9958 1.0075 0.9897 0.9878 0.9893
dispcorr: -0.030193377 hartree
energy: -11427.159566577420
dipole: -154.80608 155.23837 0.43229 37.12231 -37.57301 -0.45070 -60.18918 58.82626 -1.36291
magnitude: 1.49918 au
magnitude: 3.81062 debye
