program: Orca
programVersion: 5.0.2
elementType: Br Br Br Br O O O N C C C C C C C C C C C C C C C C C C C C C C H H H H H H H H H H H H H H H H H H H
charge: 0
multiplicity: 1
keywords: wb97x-d3
keywords: def2-TZVPP
keywords: def2/J RIJCOSX
keywords: DEFGRID2
keywords: scfconv7
keywords: smallprint printgap noloewdin
keywords: NOSOSCF
formula: C22H19Br4NO3
InChI: InChI=1/C22H19Br4NO3/c1-21(2)17(19(23)22(24,25)26)18(21)20(28)30-16(12-27)13-7-6-10-15(11-13)29-14-8-4-3-5-9-14/h3-11,16-19H,1-2H3
49 atoms
Br 3.713848 0.548569 0.06937
Br 2.467307 -1.076075 2.84051
Br 1.02583 -3.130994 0.96173
Br 4.127908 -2.776477 0.776453
O  -2.42657 -1.155758 -1.05191
O  -1.890721 -0.250979 0.92162
O  -3.942552 3.401317 -2.436611
N  -5.062829 -2.494437 -2.513207
C  0.424495 0.823203 -1.054253
C  0.942022 -0.043113 0.053182
C  -0.216696 -0.527368 -0.773385
C  2.256759 -0.762987 -0.027262
C  1.153002 0.931751 -2.371059
C  -0.273824 2.10182 -0.659863
C  -1.558955 -0.619185 -0.175389
C  2.464334 -1.828087 1.06167
C  -3.797883 -1.12174 -0.684509
C  -4.351257 0.28575 -0.640498
C  -4.486866 -1.897407 -1.716718
C  -3.906814 1.228169 -1.558124
C  -5.290466 0.624627 0.321704
C  -4.40109 2.521032 -1.495176
C  -5.792586 1.917889 0.356034
C  -5.352546 2.874372 -0.544977
C  -3.735665 4.714548 -2.084353
C  -3.036015 5.055425 -0.933254
C  -4.201032 5.690138 -2.952197
C  -2.811948 6.395631 -0.653392
C  -3.958298 7.026697 -2.665363
C  -3.270044 7.384772 -1.514628
H  0.684973 0.318006 1.044112
H  -0.009835 -1.273862 -1.532598
H  2.365845 -1.263447 -0.993361
H  1.652943 0.008518 -2.662998
H  0.442962 1.179448 -3.16153
H  1.897536 1.727334 -2.336968
H  -0.791079 2.033284 0.295374
H  0.460501 2.904409 -0.575908
H  -0.998329 2.396252 -1.421118
H  -3.966352 -1.625728 0.273401
H  -3.173191 0.977246 -2.314667
H  -5.624085 -0.111838 1.041293
H  -6.530329 2.188804 1.099123
H  -5.750174 3.880207 -0.503376
H  -2.664184 4.289548 -0.263283
H  -4.743223 5.406129 -3.845118
H  -2.268935 6.665451 0.242847
H  -4.319032 7.789256 -3.34295
H  -3.089091 8.427506 -1.290736
elementType: Br O N C H
nucrepener: 5550.39833674 hartree
twoeener: 9953.72585224 hartree
cpcmener: -0.03742643 hartree
xcener: -389.800492121190 hartree
chargesum: -0.0000000
charge: -0.082848 -0.013510 -0.012524 -0.002929 -0.275492 -0.439000 -0.342782 -0.099790 0.124915 -0.084382 -0.153554 -0.166807 -0.267759 -0.276043 0.382067 0.039295 0.421493 0.012220 -0.222172 -0.249696 -0.196915 0.236098 -0.133341 -0.164663 0.278484 -0.174970 -0.239693 -0.168844 -0.132412 -0.174601 0.115939 0.123702 0.168420 0.094231 0.110719 0.099324 0.100249 0.109137 0.093489 0.148569 0.146377 0.148069 0.163804 0.161185 0.163241 0.148916 0.162200 0.161315 0.161271
qa: -0.0828 -0.0135 -0.0125 -0.0029 -0.2755 -0.4390 -0.3428 -0.0998 0.1249 -0.0844 -0.1536 -0.1668 -0.2678 -0.2760 0.3821 0.0393 0.4215 0.0122 -0.2222 -0.2497 -0.1969 0.2361 -0.1333 -0.1647 0.2785 -0.1750 -0.2397 -0.1688 -0.1324 -0.1746 0.1159 0.1237 0.1684 0.0942 0.1107 0.0993 0.1002 0.1091 0.0935 0.1486 0.1464 0.1481 0.1638 0.1612 0.1632 0.1489 0.1622 0.1613 0.1613
va: 1.1820 1.2228 1.2251 1.2292 2.1201 2.0658 2.0422 3.1098 3.8608 3.7505 3.8531 4.0750 3.8939 3.8916 4.1818 4.3546 3.6933 3.6160 4.0844 4.0043 3.9845 3.7859 3.8986 3.8999 3.6544 3.8854 4.0147 3.9168 3.8850 3.8898 1.0449 1.0241 0.9930 1.0032 1.0032 1.0048 1.0130 1.0051 1.0028 1.0130 1.0214 1.0015 0.9888 0.9936 0.9919 1.0067 0.9902 0.9881 0.9889
dispcorr: -0.031381931 hartree
energy: -11427.160694377755
dipole: -138.78721 138.94076 0.15354 104.08465 -102.30385 1.78080 -61.45453 61.64075 0.18622
magnitude: 1.79708 au
magnitude: 4.56782 debye
