program: Orca
programVersion: 5.0.2
elementType: Br Br Br Br O O O N C C C C C C C C C C C C C C C C C C C C C C H H H H H H H H H H H H H H H H H H H
charge: 0
multiplicity: 1
keywords: wb97x-d3
keywords: def2-TZVPP
keywords: def2/J RIJCOSX
keywords: DEFGRID2
keywords: scfconv7
keywords: smallprint printgap noloewdin
keywords: NOSOSCF
formula: C22H19Br4NO3
InChI: InChI=1/C22H19Br4NO3/c1-21(2)17(19(23)22(24,25)26)18(21)20(28)30-16(12-27)13-7-6-10-15(11-13)29-14-8-4-3-5-9-14/h3-11,16-19H,1-2H3
49 atoms
Br 3.682604 0.540568 0.001568
Br 2.486426 -1.096681 2.780366
Br 1.046862 -3.172288 0.915621
Br 4.146411 -2.774192 0.698273
O  -2.449544 -1.254882 -1.027947
O  -1.891638 -0.323842 0.926845
O  -3.958367 3.283344 -2.416767
N  -5.100552 -2.656228 -2.405177
C  0.374246 0.779289 -1.082696
C  0.918877 -0.083091 0.014403
C  -0.245149 -0.581007 -0.796823
C  2.240573 -0.787417 -0.083386
C  1.08342 0.901591 -2.408833
C  -0.334392 2.048533 -0.676011
C  -1.574241 -0.694017 -0.173802
C  2.471213 -1.852116 1.001839
C  -3.813845 -1.227385 -0.635883
C  -4.377205 0.177005 -0.609166
C  -4.515758 -2.033824 -1.63501
C  -3.928019 1.116545 -1.527331
C  -5.326981 0.517777 0.341796
C  -4.425857 2.408369 -1.474784
C  -5.835092 1.80902 0.363497
C  -5.389828 2.762786 -0.537969
C  -3.716638 4.592349 -2.079273
C  -3.132945 4.950212 -0.870058
C  -4.026184 5.552599 -3.03125
C  -2.874914 6.290161 -0.616975
C  -3.749005 6.886739 -2.76904
C  -3.181543 7.262816 -1.559513
H  0.669673 0.271716 1.009525
H  -0.039902 -1.322465 -1.561364
H  2.346885 -1.28141 -1.053092
H  1.813846 1.710442 -2.382467
H  1.59654 -0.011687 -2.708909
H  0.35942 1.137911 -3.189907
H  0.392054 2.858447 -0.59446
H  -1.068005 2.338919 -1.429915
H  -0.842936 1.970276 0.283053
H  -3.959291 -1.712102 0.335611
H  -3.186462 0.865694 -2.275988
H  -5.66377 -0.215591 1.063149
H  -6.580969 2.080716 1.098082
H  -5.790599 3.76761 -0.504947
H  -2.876907 4.201151 -0.130903
H  -4.474655 5.25647 -3.97097
H  -2.424893 6.571651 0.325956
H  -3.987547 7.634136 -3.514132
H  -2.975274 8.304683 -1.354445
elementType: Br O N C H
nucrepener: 5558.77347585 hartree
twoeener: 9962.07365690 hartree
cpcmener: -0.03720439 hartree
xcener: -389.801024623551 hartree
chargesum: -0.0000000
charge: -0.082813 -0.014181 -0.012067 -0.003142 -0.276942 -0.438687 -0.342549 -0.099510 0.125529 -0.087064 -0.150815 -0.166100 -0.268342 -0.275162 0.380884 0.040430 0.419853 0.016723 -0.222799 -0.256668 -0.199041 0.252234 -0.127263 -0.176133 0.314381 -0.197738 -0.257846 -0.161823 -0.125693 -0.182982 0.115836 0.124116 0.169205 0.099414 0.094397 0.110766 0.109331 0.092132 0.100009 0.148935 0.147004 0.147920 0.163845 0.161078 0.159049 0.148449 0.161975 0.160794 0.161074
qa: -0.0828 -0.0142 -0.0121 -0.0031 -0.2769 -0.4387 -0.3425 -0.0995 0.1255 -0.0871 -0.1508 -0.1661 -0.2683 -0.2752 0.3809 0.0404 0.4199 0.0167 -0.2228 -0.2567 -0.1990 0.2522 -0.1273 -0.1761 0.3144 -0.1977 -0.2578 -0.1618 -0.1257 -0.1830 0.1158 0.1241 0.1692 0.0994 0.0944 0.1108 0.1093 0.0921 0.1000 0.1489 0.1470 0.1479 0.1638 0.1611 0.1590 0.1484 0.1620 0.1608 0.1611
va: 1.1821 1.2222 1.2256 1.2290 2.1179 2.0656 2.0443 3.1101 3.8597 3.7527 3.8526 4.0755 3.8943 3.8900 4.1792 4.3523 3.6940 3.6120 4.0824 4.0157 3.9892 3.7703 3.8914 3.9146 3.6189 3.8908 4.0185 3.9093 3.8830 3.8966 1.0456 1.0239 0.9925 1.0046 1.0032 1.0034 1.0053 1.0036 1.0137 1.0130 1.0207 1.0016 0.9886 0.9930 0.9951 1.0076 0.9899 0.9882 0.9890
dispcorr: -0.031454486 hartree
energy: -11427.160704477874
dipole: -139.32863 139.47766 0.14903 102.22078 -100.44960 1.77118 -59.97291 60.12363 0.15073
magnitude: 1.78381 au
magnitude: 4.53409 debye
