program: Gaussian 09
title: 000004925
version: EM64L-G09RevD.01
frameworkgroup: C1[X(C5H8N3O4)]
method: RPBEPBE
basis: SDD
operation: Freq
keyword: #p
keyword: freq=noraman
keyword: PBEPBE/SDD
title: #p freq=noraman PBEPBE/SDD
converged: YES YES NO NO
title: Mulliken charges:
elementType: O O O O N N N C C C C C H H H H H H H H
charge: -0.452427 -0.229704 -0.416489 -0.414637 -0.065026 0.014037 -0.046996 -0.177243 -0.474668 -0.467472 -0.385635 0.147142 0.307617 0.214678 0.240398 0.203861 0.198649 0.249708 0.205355 0.348853
chargesum: -1.00000
title: Mulliken charges with hydrogens summed into heavy atoms:
elementType: O O O O N N N C C C C C
charge: -0.103574 -0.229704 -0.416489 -0.414637 -0.065026 0.014037 -0.046996 0.130374 -0.019591 -0.064962 0.069427 0.147142
polarizability: 1.28348965e+02 -2.07363615e+00 8.14538399e+01 -9.20293702e+00 -5.10565113e+00 8.72303247e+01
1716.lowfreq: -5.3025 0.0006 0.0009 0.0010 7.5898 16.6374 32.7351 56.2098 66.2241
frequency: 32.1728 56.0817 66.2189 131.5574 174.0803 190.9397 241.6705 257.3046 293.6581 333.9372 392.8282 421.4007 473.2089 510.7621 546.4607 568.7423 609.3950 652.8943 662.8174 768.6428 813.9803 839.7597 879.3337 908.2617 917.0119 950.9712 964.0624 1002.1153 1045.9980 1090.8094 1111.5042 1142.1872 1157.0367 1162.1010 1195.8705 1215.4153 1250.5023 1258.0498 1282.3285 1301.4564 1312.3328 1317.2910 1459.9929 1466.3899 1476.8851 1665.9174 2764.9161 2978.5075 2985.0808 3004.3745 3048.5574 3078.6973 3093.4974 3501.3334
redmass: 11.2752 4.2832 9.9677 4.7227 3.2158 5.0051 3.5824 9.5240 5.2822 4.2678 8.8657 6.5842 4.6320 2.1136 9.7719 3.2034 1.6573 5.3975 3.9891 4.5660 4.3583 2.0028 2.5724 2.4193 2.4245 3.0021 3.9728 2.3349 1.8756 2.1283 2.0829 2.5285 3.2401 1.6618 2.3253 1.3703 1.9764 1.6539 1.4027 1.3498 1.4541 1.4960 1.0854 1.0924 1.0901 8.2688 1.0762 1.0691 1.0606 1.0653 1.0998 1.0969 1.1019 1.0637
irintensity: 0.5603 1.6437 0.2521 6.4570 1.9372 1.7519 9.3895 1.6222 1.5196 2.0195 12.4283 18.1588 33.3667 42.2327 41.4938 10.5093 53.0522 41.2253 24.6388 13.5871 3.6446 49.4399 19.6866 170.4129 24.2908 111.1210 71.4232 193.5646 45.3939 1.0194 13.2374 104.0657 136.8359 13.1712 24.0895 3.0244 11.5343 16.9142 14.9605 13.8507 20.6437 5.7278 6.3134 9.1533 2.4085 240.3680 279.4371 27.6354 59.9247 28.7135 72.9709 29.1711 34.2939 2.1327
temp: 298.150 k
press: 1.00000 atm
elementType: 8 8 8 8 7 7 7 6 6 6 6 6 1 1 1 1 1 1 1 1
symmnumber: 1
zpe: 371005.7 jmol-1
zpe.correction: 0.141309 hartree
zpe.thermalcorrener: 0.152905 hartree
zpe.thermalcorrenthalpy: 0.153849 hartree
zpe.thermalcorrgfe: 0.102633 hartree
zpe.sumelectzpe: -659.466679 hartree
zpe.sumelectthermal: -659.455082 hartree
zpe.sumelectthermalent: -659.454138 hartree
zpe.sumelectthermalfe: -659.505355 hartree
dipole: -8.7881 4.7038 1.1635
dipole: 10.0354
quadrupole: -99.4566 -76.5751 -85.9419
quadrupole: 7.2541 3.2327 1.4904
quadrupole: -12.1321 10.7494 1.3826 7.2541 3.2327 1.4904
hfenergy: -659.6079871 hartree
pointgroup: C01 [X(C5H8N3O4)]
dipole: -3.8620367 -0.6898271 0.4442346 debye
dipolederiv: -1.3372156 0.1585556 -0.2331026 0.1884377 -0.3627056 0.1371145 -0.2472412 0.1205722 -0.4189236 -0.5483402 0.0585423 -0.0897929 0.0611901 -0.821679 -0.4134061 -0.1106123 -0.4010673 -0.6634547 -0.9065234 0.1383575 0.0469617 0.1412213 -0.4444918 0.1899988 -0.2721596 0.3386067 -0.9894244 -0.5943529 0.0211587 -0.0324229 0.284311 -0.4246086 0.1599588 -1.0102256 0.2785026 -0.8311573 -0.8158804 -0.1387908 0.1999208 -0.0375595 -0.3209567 0.1023392 0.3403329 0.0958065 -0.4718938 0.6752448 0.1450341 -0.4381666 -0.0637476 0.0106611 -0.2367298 -0.15709 -0.4554739 0.8105889 0.2039088 -0.150493 0.2563748 -0.3024632 -0.0786708 -0.1608936 1.105668 -0.2257078 0.3508546 0.201277 0.0307754 0.0522783 -0.0278717 -0.0004564 -0.0323316 0.525126 -0.2443542 -0.1988782 -0.006141 0.0090813 -0.0240265 -0.015931 0.0497724 0.0305318 -0.0294753 0.0731284 0.1096341 -0.0816412 -0.0353028 -0.0538662 -0.080171 0.0865355 0.0711295 -0.0805613 0.049142 0.0858377 0.1221305 0.0506246 0.0373088 0.1589859 0.404021 -0.1298925 -0.0272795 -0.0588509 0.2445935 1.4262486 -0.36074 0.2781198 -0.4761686 0.9805385 0.5303864 0.230135 0.5899913 0.7405831 0.427291 -0.0862141 -0.0751404 0.0824555 0.0174548 -0.0027827 -0.4014809 0.1776197 0.1951327 0.0872997 0.045251 0.0668638 0.0039281 -0.0354956 -0.0765449 -0.0019331 -0.0911949 -0.1086691 -0.187012 0.0066151 -0.0385457 0.0134456 0.1022555 0.0150242 -0.0012618 0.013163 0.0756028 -0.0202782 0.0148663 0.0936303 0.0712589 0.0437222 -0.0861754 0.0940122 -0.0347039 -0.1265715 0.0374447 -0.057377 0.017885 -0.1081398 -0.2515927 0.0377409 -0.0137071 -0.002959 0.0791033 0.0265729 0.0412417 -0.0889654 -0.0132968 0.0387113 0.0294521 -0.0341523 0.074635 -0.1054856 0.0083021 0.0805279 0.0326023 0.0238672 -0.1182838 -0.0330667 0.0341172 -0.1189278 -0.0173593 0.2816648 0.028286 -0.0079164 0.0962478 0.1252688 -0.131853 0.057789 -0.1779275 0.2398868 unknown
polarizability: 126.9743347|-12.0126197|81.7117443|2.9808631|-4.2760046|88.3470503 unknown
InChI: InChI=1S/C5H8N3O4/c9-5(10)4-2-1-3-7(4)8(12)6-11/h4,9H,1-3H2
charge -1 multiplicity 1
20 atoms
O  -2.959097 1.387077 -0.119015
O  -1.171901 2.057693 1.190394
O  1.111732 0.292972 -2.113411
O  2.977228 -0.773178 0.724532
N  0.393681 -0.225695 0.201365
N  1.49368 -0.124241 -0.886256
N  2.78455 -0.393842 -0.54598
C  -0.900969 0.140853 -0.412485
C  -1.727821 -1.176109 -0.506175
C  -1.214525 -1.968206 0.722783
C  0.299706 -1.621185 0.757114
C  -1.604253 1.256248 0.335318
H  -0.633451 0.526473 -1.437512
H  -1.439681 -1.696718 -1.438956
H  -2.815741 -1.003916 -0.509334
H  -1.716762 -1.60673 1.641515
H  -1.388478 -3.05731 0.639976
H  0.751145 -1.648327 1.761202
H  0.868611 -2.32462 0.11714
H  -3.337653 2.176662 0.355187
