program: Orca
programVersion: 5.0.2
elementType: Br Br Br Br O O O N C C C C C C C C C C C C C C C C C C C C C C H H H H H H H H H H H H H H H H H H H
charge: 0
multiplicity: 1
keywords: wb97x-d3
keywords: def2-TZVPP
keywords: def2/J RIJCOSX
keywords: DEFGRID2
keywords: scfconv7
keywords: smallprint printgap noloewdin
keywords: NOSOSCF
formula: C22H19Br4NO3
InChI: InChI=1/C22H19Br4NO3/c1-21(2)17(19(23)22(24,25)26)18(21)20(28)30-16(12-27)13-7-6-10-15(11-13)29-14-8-4-3-5-9-14/h3-11,16-19H,1-2H3
49 atoms
Br 3.777995 0.183259 1.208844
Br 2.191447 -2.872507 1.643835
Br 0.887864 -2.564177 -1.187794
Br 3.995537 -2.512326 -0.90923
O  -2.267031 -0.054423 -0.982515
O  -1.871601 -0.406091 1.188693
O  -5.31591 4.031512 -0.119067
N  -4.539094 -0.915411 -3.2091
C  0.58685 1.513151 0.591327
C  1.010276 0.083357 0.680028
C  -0.138469 0.455655 -0.225292
C  2.287588 -0.432601 0.088403
C  1.382168 2.510492 -0.216167
C  -0.052439 2.121757 1.813988
C  -1.483638 -0.040009 0.108169
C  2.347267 -1.963302 -0.05292
C  -3.598943 -0.520888 -0.802518
C  -4.473533 0.469798 -0.070597
C  -4.108166 -0.738983 -2.15751
C  -4.459982 1.804656 -0.453433
C  -5.29023 0.035241 0.962907
C  -5.262696 2.708433 0.226988
C  -6.106665 0.948044 1.61489
C  -6.090809 2.28698 1.25872
C  -4.158453 4.687685 -0.465375
C  -4.235715 5.600634 -1.506546
C  -2.969657 4.496037 0.227788
C  -3.108852 6.332621 -1.854961
C  -1.848684 5.226485 -0.139603
C  -1.911377 6.145918 -1.178745
H  0.720098 -0.396353 1.609345
H  0.070194 0.504695 -1.287739
H  2.457471 -0.008572 -0.905084
H  1.81872 2.085719 -1.119594
H  0.733932 3.331792 -0.526959
H  2.187772 2.935158 0.383306
H  0.717339 2.595486 2.424996
H  -0.77023 2.893041 1.530766
H  -0.563941 1.394657 2.440338
H  -3.610364 -1.487139 -0.287226
H  -3.83254 2.135596 -1.272866
H  -5.289197 -1.006436 1.256505
H  -6.747229 0.618639 2.421705
H  -6.715667 3.003165 1.776608
H  -5.169994 5.740041 -2.035395
H  -2.91067 3.790652 1.047499
H  -3.170448 7.046416 -2.66587
H  -0.921705 5.077717 0.399188
H  -1.033823 6.713692 -1.457198
elementType: Br O N C H
nucrepener: 5616.89730264 hartree
cpcmener: -0.03767726 hartree
xcener: -389.800893002240 hartree
chargesum: -0.0000000
charge: -0.081694 -0.012400 -0.011719 -0.002943 -0.280138 -0.453824 -0.340739 -0.099246 0.108006 -0.097898 -0.139165 -0.154108 -0.263515 -0.259661 0.396388 0.035882 0.430111 0.013109 -0.221262 -0.190471 -0.202625 0.234349 -0.118488 -0.227927 0.281064 -0.255228 -0.181536 -0.117958 -0.149717 -0.200645 0.119468 0.120564 0.169665 0.094818 0.105518 0.099956 0.104360 0.085942 0.098188 0.146976 0.150145 0.149933 0.162714 0.151666 0.148584 0.163623 0.161369 0.169658 0.160850
qa: -0.0817 -0.0124 -0.0117 -0.0029 -0.2801 -0.4538 -0.3407 -0.0992 0.1080 -0.0979 -0.1392 -0.1541 -0.2635 -0.2597 0.3964 0.0359 0.4301 0.0131 -0.2213 -0.1905 -0.2026 0.2343 -0.1185 -0.2279 0.2811 -0.2552 -0.1815 -0.1180 -0.1497 -0.2006 0.1195 0.1206 0.1697 0.0948 0.1055 0.1000 0.1044 0.0859 0.0982 0.1470 0.1501 0.1499 0.1627 0.1517 0.1486 0.1636 0.1614 0.1697 0.1608
va: 1.1822 1.2233 1.2284 1.2290 2.1235 2.0566 2.0669 3.1110 3.8488 3.7410 3.8830 4.0628 3.9049 3.8974 4.1301 4.3469 3.7028 3.6012 4.0884 3.9323 3.9690 3.7610 3.8958 4.0075 3.7135 4.0099 3.8838 3.8778 3.8679 3.9327 1.0447 1.0242 0.9923 1.0056 1.0063 1.0047 1.0040 1.0066 1.0196 1.0153 1.0147 1.0019 0.9879 1.0032 1.0070 0.9916 0.9872 0.9823 0.9910
dispcorr: -0.031790436 hartree
energy: -11427.161837404379
dipole: -131.00574 131.68326 0.67752 116.11348 -114.67294 1.44055 -3.47427 4.27424 0.79996
magnitude: 1.78162 au
magnitude: 4.52851 debye
