program: Orca
programVersion: 5.0.2
elementType: Br Br Br Br O O O N C C C C C C C C C C C C C C C C C C C C C C H H H H H H H H H H H H H H H H H H H
charge: 0
multiplicity: 1
keywords: wb97x-d3
keywords: def2-TZVPP
keywords: def2/J RIJCOSX
keywords: DEFGRID2
keywords: scfconv7
keywords: smallprint printgap noloewdin
keywords: NOSOSCF
formula: C22H19Br4NO3
InChI: InChI=1/C22H19Br4NO3/c1-21(2)17(19(23)22(24,25)26)18(21)20(28)30-16(12-27)13-7-6-10-15(11-13)29-14-8-4-3-5-9-14/h3-11,16-19H,1-2H3
49 atoms
Br 3.970084 -0.560105 1.549588
Br 2.014381 -3.373914 1.912216
Br 0.843261 -2.89619 -0.959586
Br 3.927138 -3.23725 -0.579657
O  -1.944116 0.107733 -0.908762
O  -1.723384 -0.263601 1.286229
O  -4.34933 4.646937 -1.557643
N  -4.19993 -0.7471 -3.160622
C  1.033733 1.197029 0.815029
C  1.235259 -0.28055 0.909527
C  0.198615 0.262068 -0.045645
C  2.455428 -0.966787 0.369091
C  2.003618 2.06898 0.055035
C  0.433298 1.897007 2.0087
C  -1.226067 0.004215 0.221481
C  2.330957 -2.491559 0.224485
C  -3.357673 -0.034454 -0.792056
C  -4.009605 1.252288 -0.348863
C  -3.813069 -0.429126 -2.125419
C  -3.877054 2.394214 -1.129833
C  -4.706233 1.296046 0.850159
C  -4.463395 3.579337 -0.712483
C  -5.28543 2.490229 1.255817
C  -5.172495 3.634877 0.483223
C  -4.368656 5.925053 -1.046046
C  -5.272055 6.825473 -1.587663
C  -3.469837 6.316684 -0.062706
C  -5.270799 8.140125 -1.140399
C  -3.486114 7.630354 0.381759
C  -4.38369 8.545933 -0.15344
H  0.836054 -0.719768 1.818458
H  0.463201 0.280725 -1.096593
H  2.720842 -0.572318 -0.615247
H  2.834447 2.37045 0.693347
H  2.41381 1.589816 -0.833479
H  1.495426 2.976418 -0.274283
H  -0.160693 2.756173 1.693652
H  -0.195288 1.251613 2.617084
H  1.235839 2.266905 2.648542
H  -3.620168 -0.847785 -0.108581
H  -3.331262 2.372078 -2.066455
H  -4.802567 0.406941 1.459179
H  -5.837328 2.532211 2.185066
H  -5.6423 4.55341 0.81016
H  -5.964741 6.503586 -2.354768
H  -2.761116 5.60897 0.349138
H  -5.972971 8.846003 -1.564228
H  -2.786633 7.939975 1.146959
H  -4.388149 9.569896 0.195312
elementType: Br O N C H
nucrepener: 5447.10784156 hartree
twoeener: 9850.60365762 hartree
cpcmener: -0.03569097 hartree
xcener: -389.798007232389 hartree
chargesum: -0.0000000
charge: -0.082794 -0.012804 -0.012351 -0.002979 -0.277264 -0.459359 -0.336752 -0.099699 0.095104 -0.085783 -0.150873 -0.158605 -0.259374 -0.267641 0.412875 0.038131 0.427085 -0.003686 -0.223418 -0.230695 -0.183383 0.239104 -0.145172 -0.168924 0.245684 -0.223177 -0.172535 -0.138682 -0.155936 -0.170147 0.120138 0.119356 0.169120 0.097856 0.093575 0.109043 0.107911 0.094414 0.100124 0.140336 0.137455 0.149896 0.163792 0.159389 0.149063 0.166937 0.161638 0.162019 0.161987
qa: -0.0828 -0.0128 -0.0124 -0.0030 -0.2773 -0.4594 -0.3368 -0.0997 0.0951 -0.0858 -0.1509 -0.1586 -0.2594 -0.2676 0.4129 0.0381 0.4271 -0.0037 -0.2234 -0.2307 -0.1834 0.2391 -0.1452 -0.1689 0.2457 -0.2232 -0.1725 -0.1387 -0.1559 -0.1701 0.1201 0.1194 0.1691 0.0979 0.0936 0.1090 0.1079 0.0944 0.1001 0.1403 0.1375 0.1499 0.1638 0.1594 0.1491 0.1669 0.1616 0.1620 0.1620
va: 1.1820 1.2225 1.2278 1.2286 2.1301 2.0518 2.0603 3.1110 3.8627 3.7343 3.8962 4.0687 3.8998 3.9012 4.1282 4.3470 3.7132 3.6459 4.0813 4.0731 3.9459 3.7953 3.9182 3.8925 3.7035 3.9989 3.9122 3.8824 3.8911 3.8852 1.0423 1.0249 0.9931 1.0062 1.0040 1.0024 0.9991 1.0180 1.0023 1.0157 1.0250 1.0055 0.9898 0.9956 1.0054 0.9921 0.9882 0.9896 0.9887
dispcorr: -0.028839579 hartree
energy: -11427.159005935591
dipole: -131.15612 131.39109 0.23497 150.37133 -148.04076 2.33057 -9.32704 10.64419 1.31715
magnitude: 2.68732 au
magnitude: 6.83062 debye
