program: Orca
programVersion: 5.0.2
elementType: Br Br Br Br O O O N C C C C C C C C C C C C C C C C C C C C C C H H H H H H H H H H H H H H H H H H H
charge: 0
multiplicity: 1
keywords: wb97x-d3
keywords: def2-TZVPP
keywords: def2/J RIJCOSX
keywords: DEFGRID2
keywords: scfconv7
keywords: smallprint printgap noloewdin
keywords: NOSOSCF
formula: C22H19Br4NO3
InChI: InChI=1/C22H19Br4NO3/c1-21(2)17(19(23)22(24,25)26)18(21)20(28)30-16(12-27)13-7-6-10-15(11-13)29-14-8-4-3-5-9-14/h3-11,16-19H,1-2H3
49 atoms
Br 3.585357 -1.187311 1.93969
Br 2.068438 -3.583587 -0.080967
Br 1.272499 -1.314257 -2.096082
Br 4.280039 -1.74276 -1.359307
O  -2.083264 0.410069 -0.641378
O  -1.943584 -1.216462 0.885227
O  -5.677583 4.042376 0.838463
N  -3.874635 0.699539 -3.402239
C  0.489491 0.472721 1.923995
C  0.955863 -0.681891 1.097718
C  -0.088751 0.253302 0.535061
C  2.32679 -0.757757 0.494072
C  1.336778 1.714748 2.067819
C  -0.311755 0.165818 3.164713
C  -1.444175 -0.282293 0.313618
C  2.47972 -1.782046 -0.644553
C  -3.430673 0.028612 -0.917516
C  -4.389028 0.707162 0.029139
C  -3.666876 0.416106 -2.30912
C  -4.567388 2.085211 -0.044519
C  -5.042893 -0.042365 0.995629
C  -5.406582 2.709194 0.867051
C  -5.884164 0.596158 1.896776
C  -6.063596 1.966864 1.843355
C  -4.785028 4.927991 0.291251
C  -5.271904 5.835877 -0.63651
C  -3.456482 4.96443 0.695807
C  -4.41791 6.795981 -1.161762
C  -2.611252 5.920443 0.152558
C  -3.085936 6.83838 -0.775626
H  0.564658 -1.637828 1.431313
H  0.235546 0.982295 -0.19845
H  2.642579 0.212868 0.102064
H  1.887737 1.970749 1.162687
H  0.699811 2.568331 2.305939
H  2.054912 1.60428 2.881304
H  0.362176 0.101714 4.020776
H  -1.030578 0.961004 3.369979
H  -0.853823 -0.774901 3.107686
H  -3.550597 -1.057444 -0.861873
H  -4.064646 2.660723 -0.813197
H  -4.89908 -1.113483 1.047442
H  -6.397411 0.020774 2.655778
H  -6.716246 2.466025 2.54861
H  -6.311166 5.795841 -0.93791
H  -3.081669 4.260049 1.428299
H  -4.799018 7.509326 -1.881081
H  -1.575289 5.949789 0.464604
H  -2.421904 7.584767 -1.191455
elementType: Br O N C H
nucrepener: 5532.57851403 hartree
twoeener: 9935.90510835 hartree
cpcmener: -0.02966488 hartree
xcener: -389.799636071278 hartree
chargesum: 0.0000000
charge: -0.079314 -0.010490 -0.010741 -0.002048 -0.273869 -0.440497 -0.323952 -0.085665 0.096832 -0.103809 -0.153287 -0.149861 -0.261677 -0.264294 0.408823 0.035243 0.411294 -0.001553 -0.233344 -0.188111 -0.191569 0.256851 -0.113249 -0.236597 0.270756 -0.233675 -0.194873 -0.124614 -0.140005 -0.177738 0.120046 0.116609 0.168283 0.093192 0.108882 0.098749 0.099025 0.104182 0.095532 0.136960 0.143178 0.143699 0.158868 0.148321 0.146022 0.158038 0.157822 0.158946 0.158676
qa: -0.0793 -0.0105 -0.0107 -0.0020 -0.2739 -0.4405 -0.3240 -0.0857 0.0968 -0.1038 -0.1533 -0.1499 -0.2617 -0.2643 0.4088 0.0352 0.4113 -0.0016 -0.2333 -0.1881 -0.1916 0.2569 -0.1132 -0.2366 0.2708 -0.2337 -0.1949 -0.1246 -0.1400 -0.1777 0.1200 0.1166 0.1683 0.0932 0.1089 0.0987 0.0990 0.1042 0.0955 0.1370 0.1432 0.1437 0.1589 0.1483 0.1460 0.1580 0.1578 0.1589 0.1587
va: 1.1851 1.2242 1.2284 1.2301 2.1348 2.0738 2.0845 3.1127 3.8679 3.7482 3.9144 4.0616 3.9025 3.8993 4.1416 4.3430 3.7408 3.6496 4.0741 3.9600 3.9496 3.7795 3.9094 4.0075 3.7010 4.0138 3.9293 3.8838 3.8856 3.9039 1.0433 1.0242 0.9935 1.0045 1.0027 1.0062 1.0023 0.9996 1.0187 1.0179 1.0121 1.0114 0.9893 1.0057 1.0072 0.9959 0.9893 0.9902 0.9903
dispcorr: -0.029366311 hartree
energy: -11427.175169670061
dipole: -139.98777 140.29710 0.30933 110.06719 -108.86432 1.20287 33.65418 -31.98947 1.66472
magnitude: 2.07698 au
magnitude: 5.27927 debye
