program: Orca
programVersion: 5.0.2
elementType: Br Br Br Br O O O N C C C C C C C C C C C C C C C C C C C C C C H H H H H H H H H H H H H H H H H H H
charge: 0
multiplicity: 1
keywords: wb97x-d3
keywords: def2-TZVPP
keywords: def2/J RIJCOSX
keywords: DEFGRID2
keywords: scfconv7
keywords: smallprint printgap noloewdin
keywords: NOSOSCF
formula: C22H19Br4NO3
InChI: InChI=1/C22H19Br4NO3/c1-21(2)17(19(23)22(24,25)26)18(21)20(28)30-16(12-27)13-7-6-10-15(11-13)29-14-8-4-3-5-9-14/h3-11,16-19H,1-2H3
49 atoms
Br 3.489299 -2.493042 -1.16588
Br 3.554119 0.604593 0.377511
Br 1.487353 -0.440314 2.496918
Br 4.215124 -1.919016 2.134605
O  -2.308879 -0.492076 0.836287
O  -1.141662 0.725481 -0.628346
O  -5.299142 2.846278 -2.91794
N  -4.608542 0.10625 3.124062
C  0.001568 -2.141778 -1.351756
C  0.990894 -1.319348 -0.589008
C  -0.407526 -1.478094 -0.04736
C  2.150106 -1.91868 0.149609
C  0.049466 -3.650454 -1.314311
C  -0.478843 -1.60219 -2.675773
C  -1.28525 -0.29549 -0.008126
C  2.810082 -0.986579 1.180435
C  -3.263266 0.559998 0.931344
C  -4.196959 0.58588 -0.255155
C  -4.00727 0.291003 2.163419
C  -4.303448 1.744473 -1.010007
C  -4.922219 -0.552189 -0.587345
C  -5.168584 1.768007 -2.097695
C  -5.76637 -0.518056 -1.685345
C  -5.90042 0.638078 -2.438003
C  -5.128129 4.123034 -2.453171
C  -4.421149 4.997189 -3.266158
C  -5.691992 4.559726 -1.260629
C  -4.281999 6.323498 -2.882876
C  -5.532087 5.885397 -0.883481
C  -4.829552 6.771809 -1.689043
H  1.195795 -0.353879 -1.041075
H  -0.546904 -2.171037 0.77465
H  1.846167 -2.823244 0.683057
H  -0.944503 -4.053746 -1.515509
H  0.721805 -4.036851 -2.081149
H  0.367906 -4.051231 -0.351958
H  -1.503121 -1.922525 -2.874834
H  -0.44637 -0.516555 -2.737153
H  0.151459 -1.992033 -3.476906
H  -2.769874 1.529962 1.052728
H  -3.711482 2.612897 -0.74822
H  -4.835924 -1.456523 0.002482
H  -6.33718 -1.396833 -1.954584
H  -6.566283 0.665612 -3.291368
H  -3.992073 4.642261 -4.1949
H  -6.255966 3.88277 -0.63095
H  -3.735663 7.005935 -3.521127
H  -5.969804 6.226243 0.04593
H  -4.714473 7.805365 -1.390256
elementType: Br O N C H
nucrepener: 5483.75681350 hartree
twoeener: 9887.36441851 hartree
cpcmener: -0.03049655 hartree
xcener: -389.802589714077 hartree
chargesum: -0.0000000
charge: -0.079666 -0.010731 -0.010811 -0.002835 -0.271794 -0.432275 -0.323680 -0.085953 0.094532 -0.088490 -0.150076 -0.156148 -0.260921 -0.261580 0.390431 0.034159 0.407459 0.006980 -0.225508 -0.182226 -0.231021 0.282873 -0.122408 -0.231412 0.293592 -0.250983 -0.204330 -0.116920 -0.137636 -0.186505 0.118981 0.117445 0.166407 0.109082 0.098855 0.091464 0.103314 0.095341 0.099775 0.137465 0.143938 0.146971 0.159120 0.147993 0.145538 0.157125 0.157398 0.159482 0.158189
qa: -0.0797 -0.0107 -0.0108 -0.0028 -0.2718 -0.4323 -0.3237 -0.0860 0.0945 -0.0885 -0.1501 -0.1561 -0.2609 -0.2616 0.3904 0.0342 0.4075 0.0070 -0.2255 -0.1822 -0.2310 0.2829 -0.1224 -0.2314 0.2936 -0.2510 -0.2043 -0.1169 -0.1376 -0.1865 0.1190 0.1174 0.1664 0.1091 0.0989 0.0915 0.1033 0.0953 0.0998 0.1375 0.1439 0.1470 0.1591 0.1480 0.1455 0.1571 0.1574 0.1595 0.1582
va: 1.1841 1.2242 1.2290 1.2297 2.1318 2.0846 2.0889 3.1126 3.8730 3.7323 3.8867 4.0618 3.8999 3.8999 4.1631 4.3525 3.7372 3.6059 4.0733 3.9372 3.9810 3.7433 3.9133 4.0102 3.6831 4.0162 3.9261 3.8797 3.8859 3.9098 1.0444 1.0243 0.9944 1.0024 1.0059 1.0046 1.0001 1.0179 1.0025 1.0180 1.0118 1.0105 0.9894 1.0058 1.0085 0.9967 0.9894 0.9900 0.9905
dispcorr: -0.029047437 hartree
energy: -11427.174971111812
dipole: -163.52633 163.24740 -0.27893 48.68475 -49.26429 -0.57954 -60.84095 59.62182 -1.21913
magnitude: 1.37838 au
magnitude: 3.50357 debye
