program: Orca
programVersion: 5.0.2
elementType: Br Br Br Br O O O N C C C C C C C C C C C C C C C C C C C C C C H H H H H H H H H H H H H H H H H H H
charge: 0
multiplicity: 1
keywords: wb97x-d3
keywords: def2-TZVPP
keywords: def2/J RIJCOSX
keywords: DEFGRID2
keywords: scfconv7
keywords: smallprint printgap noloewdin
keywords: NOSOSCF
formula: C22H19Br4NO3
InChI: InChI=1/C22H19Br4NO3/c1-21(2)17(19(23)22(24,25)26)18(21)20(28)30-16(12-27)13-7-6-10-15(11-13)29-14-8-4-3-5-9-14/h3-11,16-19H,1-2H3
49 atoms
Br 3.142808 -3.24729 -0.876585
Br 3.858842 0.079954 -0.310897
Br 2.008477 0.013305 2.229471
Br 4.433139 -1.943894 2.030405
O  -2.08056 0.032074 1.033008
O  -0.943905 0.6993 -0.77087
O  -5.616454 2.993609 -2.80201
N  -4.269157 1.35501 3.120302
C  -0.243711 -2.404496 -0.780011
C  0.935426 -1.567659 -0.391265
C  -0.377817 -1.360762 0.317585
C  2.107123 -2.128522 0.359766
C  -0.368382 -3.838026 -0.322094
C  -0.845528 -2.169605 -2.143567
C  -1.119984 -0.106877 0.104079
C  3.038288 -1.082132 0.996831
C  -2.945558 1.144931 0.877463
C  -3.923032 0.969581 -0.263587
C  -3.675781 1.245943 2.142958
C  -4.287673 2.085738 -1.000957
C  -4.465101 -0.278553 -0.542475
C  -5.227612 1.952355 -2.015937
C  -5.375322 -0.400009 -1.581211
C  -5.767602 0.708682 -2.314512
C  -5.69659 4.265799 -2.301398
C  -5.286572 5.294151 -3.137671
C  -6.222508 4.539581 -1.044465
C  -5.401048 6.608974 -2.709543
C  -6.316744 5.858608 -0.624466
C  -5.908265 6.897236 -1.450375
H  1.188721 -0.803265 -1.119263
H  -0.479681 -1.780649 1.312106
H  1.773615 -2.796611 1.158401
H  -1.422106 -4.118757 -0.278117
H  0.122022 -4.514163 -1.023311
H  0.050446 -4.016069 0.668359
H  -0.709299 -1.153153 -2.506078
H  -0.377053 -2.838855 -2.867078
H  -1.91505 -2.38734 -2.136978
H  -2.378024 2.073039 0.751374
H  -3.836784 3.046124 -0.781399
H  -4.186801 -1.150616 0.034972
H  -5.796787 -1.36854 -1.815456
H  -6.487391 0.612782 -3.117575
H  -4.887283 5.065433 -4.117879
H  -6.558396 3.741173 -0.394676
H  -5.084738 7.409939 -3.365098
H  -6.721108 6.071894 0.356646
H  -5.989152 7.923145 -1.116081
elementType: Br O N C H
nucrepener: 5448.52110811 hartree
twoeener: 9851.90990017 hartree
cpcmener: -0.03148282 hartree
xcener: -389.801828378666 hartree
chargesum: 0.0000000
charge: -0.080560 -0.010191 -0.011972 -0.001707 -0.275894 -0.424201 -0.324379 -0.086112 0.098514 -0.081678 -0.144738 -0.167012 -0.263539 -0.261634 0.371496 0.036583 0.406290 0.033391 -0.227265 -0.206517 -0.233732 0.284061 -0.121131 -0.227274 0.296517 -0.254831 -0.206156 -0.115718 -0.137396 -0.189233 0.118034 0.118567 0.168790 0.108683 0.099922 0.092397 0.097838 0.102768 0.098853 0.141624 0.143393 0.148049 0.158786 0.148440 0.146113 0.157967 0.158123 0.159664 0.158005
qa: -0.0806 -0.0102 -0.0120 -0.0017 -0.2759 -0.4242 -0.3244 -0.0861 0.0985 -0.0817 -0.1447 -0.1670 -0.2635 -0.2616 0.3715 0.0366 0.4063 0.0334 -0.2273 -0.2065 -0.2337 0.2841 -0.1211 -0.2273 0.2965 -0.2548 -0.2062 -0.1157 -0.1374 -0.1892 0.1180 0.1186 0.1688 0.1087 0.0999 0.0924 0.0978 0.1028 0.0989 0.1416 0.1434 0.1480 0.1588 0.1484 0.1461 0.1580 0.1581 0.1597 0.1580
va: 1.1840 1.2235 1.2262 1.2297 2.1180 2.0889 2.0883 3.1131 3.8676 3.7425 3.8601 4.0713 3.8986 3.8968 4.1871 4.3498 3.7205 3.6080 4.0736 3.9887 3.9516 3.7323 3.9096 4.0066 3.6810 4.0159 3.9198 3.8796 3.8856 3.9112 1.0443 1.0241 0.9932 1.0029 1.0057 1.0040 1.0169 1.0037 1.0020 1.0196 1.0062 1.0123 0.9893 1.0052 1.0084 0.9967 0.9890 0.9900 0.9907
dispcorr: -0.029380732 hartree
energy: -11427.174812311165
dipole: -174.97885 174.53746 -0.44139 55.72305 -56.59209 -0.86905 -47.24230 46.43921 -0.80309
magnitude: 1.26294 au
magnitude: 3.21013 debye
