program: Orca
programVersion: 5.0.2
elementType: Br Br Br Br O O O N C C C C C C C C C C C C C C C C C C C C C C H H H H H H H H H H H H H H H H H H H
charge: 0
multiplicity: 1
keywords: wb97x-d3
keywords: def2-TZVPP
keywords: def2/J RIJCOSX
keywords: DEFGRID2
keywords: scfconv7
keywords: smallprint printgap noloewdin
keywords: NOSOSCF
formula: C22H19Br4NO3
InChI: InChI=1/C22H19Br4NO3/c1-21(2)17(19(23)22(24,25)26)18(21)20(28)30-16(12-27)13-7-6-10-15(11-13)29-14-8-4-3-5-9-14/h3-11,16-19H,1-2H3
49 atoms
Br 3.617444 0.297135 1.142819
Br 2.001161 -2.732787 1.428882
Br 0.822768 -2.357717 -1.455458
Br 3.919381 -2.337927 -1.041877
O  -1.952429 -0.22454 0.639049
O  -2.247672 0.127432 -1.542359
O  -4.830741 3.903486 0.630057
N  -3.545594 -2.902602 -0.692557
C  0.479304 1.691245 0.374425
C  0.874185 0.250112 0.419959
C  -0.160189 0.704651 -0.587035
C  2.190826 -0.268103 -0.080392
C  1.377221 2.71768 -0.27426
C  -0.277825 2.248189 1.554678
C  -1.544419 0.199425 -0.568688
C  2.237897 -1.797155 -0.245774
C  -3.264742 -0.740328 0.753723
C  -4.355679 0.282722 0.500282
C  -3.414079 -1.935273 -0.08781
C  -4.082725 1.626187 0.708326
C  -5.630256 -0.118252 0.119516
C  -5.070247 2.570337 0.464999
C  -6.619869 0.834893 -0.070203
C  -6.345361 2.18473 0.081501
C  -3.644187 4.436357 0.200152
C  -3.096282 5.452892 0.969133
C  -3.02987 4.029629 -0.979923
C  -1.927556 6.073208 0.549778
C  -1.8578 4.653899 -1.381269
C  -1.30125 5.676362 -0.623362
H  0.486105 -0.279455 1.283472
H  0.190706 0.817882 -1.606976
H  2.437358 0.17253 -1.05013
H  2.100235 3.106695 0.44337
H  1.926616 2.331324 -1.132459
H  0.778316 3.559023 -0.626102
H  -0.956777 3.042824 1.238078
H  -0.853236 1.499887 2.094895
H  0.428716 2.684416 2.263091
H  -3.328567 -1.083739 1.790371
H  -3.106703 1.953207 1.042855
H  -5.863479 -1.164038 -0.036252
H  -7.612401 0.522193 -0.366288
H  -7.108991 2.930503 -0.098979
H  -3.585813 5.759265 1.885209
H  -3.4539 3.240292 -1.587932
H  -1.504781 6.868489 1.150096
H  -1.381972 4.338416 -2.301022
H  -0.388915 6.160352 -0.94631
elementType: Br O N C H
nucrepener: 5758.87477538 hartree
cpcmener: -0.03298731 hartree
xcener: -389.808675998284 hartree
chargesum: 0.0000000
charge: -0.079607 -0.011921 -0.009599 -0.002824 -0.272486 -0.408910 -0.328232 -0.079821 0.114602 -0.094688 -0.136528 -0.174559 -0.269889 -0.258010 0.373567 0.044117 0.454730 -0.021769 -0.244445 -0.224762 -0.205443 0.250290 -0.112445 -0.230301 0.272077 -0.227309 -0.172637 -0.116650 -0.172265 -0.188311 0.128822 0.120413 0.166992 0.100670 0.095018 0.102479 0.060143 0.099981 0.110759 0.144899 0.183124 0.135267 0.158755 0.147281 0.145308 0.153330 0.157940 0.163168 0.159679
qa: -0.0796 -0.0119 -0.0096 -0.0028 -0.2725 -0.4089 -0.3282 -0.0798 0.1146 -0.0947 -0.1365 -0.1746 -0.2699 -0.2580 0.3736 0.0441 0.4547 -0.0218 -0.2444 -0.2248 -0.2054 0.2503 -0.1124 -0.2303 0.2721 -0.2273 -0.1726 -0.1166 -0.1723 -0.1883 0.1288 0.1204 0.1670 0.1007 0.0950 0.1025 0.0601 0.1000 0.1108 0.1449 0.1831 0.1353 0.1588 0.1473 0.1453 0.1533 0.1579 0.1632 0.1597
va: 1.1845 1.2236 1.2326 1.2295 2.1259 2.0815 2.0897 3.1013 3.8144 3.7375 3.9080 4.0683 3.9016 3.8970 4.1545 4.3416 3.8124 3.7549 4.0912 3.9426 3.9680 3.7786 3.9098 4.0158 3.6928 3.9811 3.8421 3.8736 3.8414 3.8587 1.0364 1.0224 0.9936 1.0067 1.0064 1.0159 1.0185 1.0124 1.0081 0.9911 0.9710 1.0134 0.9894 1.0051 1.0080 1.0032 0.9888 0.9894 0.9898
dispcorr: -0.035332179 hartree
energy: -11427.175984801595
dipole: -124.65102 125.00261 0.35159 109.46591 -107.18980 2.27611 3.01846 -1.68524 1.33322
magnitude: 2.66116 au
magnitude: 6.76413 debye
