program: Orca
programVersion: 5.0.2
elementType: Br Br Br Br O O O N C C C C C C C C C C C C C C C C C C C C C C H H H H H H H H H H H H H H H H H H H
charge: 0
multiplicity: 1
keywords: wb97x-d3
keywords: def2-TZVPP
keywords: def2/J RIJCOSX
keywords: DEFGRID2
keywords: scfconv7
keywords: smallprint printgap noloewdin
keywords: NOSOSCF
formula: C22H19Br4NO3
InChI: InChI=1/C22H19Br4NO3/c1-21(2)17(19(23)22(24,25)26)18(21)20(28)30-16(12-27)13-7-6-10-15(11-13)29-14-8-4-3-5-9-14/h3-11,16-19H,1-2H3
49 atoms
Br 3.466058 -1.888867 -1.413879
Br 3.224358 0.949229 0.566789
Br 1.464729 -0.664963 2.598746
Br 4.333405 -1.680622 1.900518
O  -2.533758 -0.999776 0.86322
O  -1.438984 0.624803 -0.210638
O  -5.615424 2.863772 -2.34792
N  -5.234672 -1.254115 2.755062
C  -0.030887 -1.987266 -1.401309
C  0.885328 -1.150366 -0.562945
C  -0.456173 -1.550411 -0.00835
C  2.152681 -1.688894 0.033551
C  0.199665 -3.469408 -1.571174
C  -0.636121 -1.344001 -2.624066
C  -1.484262 -0.510513 0.184376
C  2.759105 -0.82982 1.157121
C  -3.645581 -0.125351 1.015949
C  -4.373998 0.101621 -0.288517
C  -4.522594 -0.77727 1.990668
C  -4.653876 1.400618 -0.683189
C  -4.735678 -0.979274 -1.083404
C  -5.285909 1.620808 -1.900616
C  -5.378419 -0.743759 -2.288699
C  -5.648636 0.550133 -2.706778
C  -4.860633 3.958078 -2.016341
C  -3.471112 3.938705 -2.045488
C  -5.547495 5.12342 -1.708247
C  -2.773314 5.10067 -1.748995
C  -4.835854 6.280969 -1.427367
C  -3.448235 6.274059 -1.439523
H  0.950118 -0.117568 -0.890601
H  -0.484708 -2.35597 0.717147
H  2.00001 -2.691452 0.442393
H  -0.74516 -3.963257 -1.80528
H  0.884518 -3.664973 -2.397078
H  0.598093 -3.951963 -0.678525
H  -0.001162 -1.537106 -3.490386
H  -1.620373 -1.766559 -2.835536
H  -0.743889 -0.26479 -2.535989
H  -3.334744 0.831544 1.448493
H  -4.369081 2.227883 -0.04503
H  -4.520951 -1.994227 -0.77275
H  -5.664856 -1.575959 -2.917985
H  -6.140286 0.731553 -3.654279
H  -2.930514 3.033328 -2.293368
H  -6.630254 5.123752 -1.694139
H  -1.691212 5.085269 -1.766897
H  -5.373689 7.189865 -1.190141
H  -2.896062 7.176398 -1.212082
elementType: Br O N C H
nucrepener: 5541.29327641 hartree
twoeener: 9944.56589261 hartree
cpcmener: -0.03080898 hartree
xcener: -389.799881473490 hartree
chargesum: -0.0000000
charge: -0.082238 -0.011032 -0.012816 -0.001212 -0.271068 -0.426599 -0.324649 -0.085976 0.097539 -0.086328 -0.147786 -0.155722 -0.263849 -0.259925 0.378335 0.034275 0.404557 0.031860 -0.225075 -0.203971 -0.254835 0.296169 -0.111990 -0.231322 0.295248 -0.202705 -0.252783 -0.139924 -0.117486 -0.185695 0.116533 0.119970 0.167621 0.108579 0.099487 0.092048 0.102038 0.100253 0.095301 0.139567 0.144219 0.146335 0.159091 0.148424 0.157746 0.145464 0.158962 0.157728 0.157635
qa: -0.0822 -0.0110 -0.0128 -0.0012 -0.2711 -0.4266 -0.3246 -0.0860 0.0975 -0.0863 -0.1478 -0.1557 -0.2638 -0.2599 0.3783 0.0343 0.4046 0.0319 -0.2251 -0.2040 -0.2548 0.2962 -0.1120 -0.2313 0.2952 -0.2027 -0.2528 -0.1399 -0.1175 -0.1857 0.1165 0.1200 0.1676 0.1086 0.0995 0.0920 0.1020 0.1003 0.0953 0.1396 0.1442 0.1463 0.1591 0.1484 0.1577 0.1455 0.1590 0.1577 0.1576
va: 1.1819 1.2231 1.2247 1.2305 2.1325 2.0850 2.0904 3.1127 3.8745 3.7402 3.8665 4.0570 3.8969 3.9007 4.1916 4.3530 3.7306 3.5814 4.0739 3.9483 3.9686 3.7286 3.8979 4.0087 3.6828 3.9169 4.0155 3.8896 3.8788 3.9107 1.0451 1.0226 0.9942 1.0027 1.0056 1.0043 1.0039 1.0017 1.0147 1.0182 1.0063 1.0121 0.9889 1.0055 0.9981 1.0084 0.9903 0.9891 0.9905
dispcorr: -0.030022591 hartree
energy: -11427.175469511087
dipole: -155.91369 156.30574 0.39205 37.52240 -37.91373 -0.39132 -59.15711 57.83791 -1.31919
magnitude: 1.43077 au
magnitude: 3.63673 debye
