program: Orca
programVersion: 5.0.2
elementType: Br Br Br Br O O O N C C C C C C C C C C C C C C C C C C C C C C H H H H H H H H H H H H H H H H H H H
charge: 0
multiplicity: 1
keywords: wb97x-d3
keywords: def2-TZVPP
keywords: def2/J RIJCOSX
keywords: DEFGRID2
keywords: scfconv7
keywords: smallprint printgap noloewdin
keywords: NOSOSCF
formula: C22H19Br4NO3
InChI: InChI=1/C22H19Br4NO3/c1-21(2)17(19(23)22(24,25)26)18(21)20(28)30-16(12-27)13-7-6-10-15(11-13)29-14-8-4-3-5-9-14/h3-11,16-19H,1-2H3
49 atoms
Br 3.787173 0.440253 0.747894
Br 2.794388 -2.872173 0.971233
Br 0.822603 -2.406495 -1.417215
Br 3.881273 -1.852759 -1.800509
O  -2.531071 -0.279769 -0.251793
O  -1.667291 -0.978817 1.696322
O  -5.254388 3.923162 -0.049927
N  -4.530574 -2.368365 -1.89421
C  0.422712 1.305362 1.041404
C  1.003137 -0.044555 0.771053
C  -0.339073 0.31099 0.178314
C  2.17918 -0.259466 -0.134796
C  0.92281 2.52989 0.312614
C  -0.007962 1.595411 2.45687
C  -1.542152 -0.389743 0.656788
C  2.417606 -1.724861 -0.537765
C  -3.804375 -0.799332 0.066746
C  -4.826962 0.303014 0.264765
C  -4.199509 -1.668171 -1.045681
C  -4.51161 1.627773 0.00596
C  -6.096576 -0.051641 0.705878
C  -5.479762 2.60535 0.214785
C  -7.055042 0.932088 0.884037
C  -6.752114 2.264372 0.648298
C  -4.018239 4.479078 0.144933
C  -3.565905 5.367429 -0.820061
C  -3.267531 4.229308 1.287755
C  -2.349944 6.011141 -0.639999
C  -2.050428 4.874831 1.449993
C  -1.584284 5.763827 0.490389
H  0.961374 -0.71479 1.624216
H  -0.358965 0.568557 -0.874659
H  2.071596 0.319521 -1.05616
H  1.782103 2.963657 0.825367
H  1.20902 2.33203 -0.720484
H  0.138058 3.288155 0.288887
H  0.827146 2.035499 3.004827
H  -0.829159 2.313953 2.472338
H  -0.322154 0.708979 3.002951
H  -3.763868 -1.423304 0.965811
H  -3.530352 1.904371 -0.355906
H  -6.33707 -1.088396 0.9087
H  -8.04646 0.663047 1.223512
H  -7.497147 3.035546 0.797504
H  -4.166119 5.557696 -1.701037
H  -3.624067 3.546767 2.049387
H  -2.000923 6.705682 -1.393216
H  -1.464856 4.68345 2.339953
H  -0.633221 6.261769 0.625806
elementType: Br O N C H
nucrepener: 5610.87285934 hartree
cpcmener: -0.03000068 hartree
xcener: -389.803601877337 hartree
chargesum: -0.0000000
charge: -0.081241 -0.011026 -0.012376 -0.001792 -0.289980 -0.427495 -0.325794 -0.087678 0.124165 -0.099451 -0.167483 -0.164139 -0.257287 -0.266035 0.402279 0.041477 0.402549 0.066232 -0.221038 -0.199963 -0.252794 0.264750 -0.106106 -0.243367 0.278701 -0.242571 -0.175085 -0.116329 -0.186403 -0.176079 0.118788 0.118211 0.167930 0.099792 0.094579 0.097339 0.103310 0.092721 0.099766 0.143221 0.151187 0.147821 0.158278 0.147123 0.145632 0.157756 0.157689 0.170889 0.159327
qa: -0.0812 -0.0110 -0.0124 -0.0018 -0.2900 -0.4275 -0.3258 -0.0877 0.1242 -0.0995 -0.1675 -0.1641 -0.2573 -0.2660 0.4023 0.0415 0.4025 0.0662 -0.2210 -0.2000 -0.2528 0.2648 -0.1061 -0.2434 0.2787 -0.2426 -0.1751 -0.1163 -0.1864 -0.1761 0.1188 0.1182 0.1679 0.0998 0.0946 0.0973 0.1033 0.0927 0.0998 0.1432 0.1512 0.1478 0.1583 0.1471 0.1456 0.1578 0.1577 0.1709 0.1593
va: 1.1829 1.2228 1.2279 1.2294 2.1020 2.0929 2.0858 3.1121 3.8380 3.7776 3.8862 4.0743 3.9030 3.9016 4.1410 4.3473 3.6760 3.6669 4.0451 3.9358 4.0084 3.7671 3.8959 4.0188 3.7047 4.0105 3.8759 3.8867 3.8490 3.8580 1.0438 1.0271 0.9933 1.0068 1.0067 1.0144 1.0024 1.0051 1.0206 1.0330 1.0146 1.0027 0.9890 1.0061 1.0079 0.9967 0.9886 0.9813 0.9910
dispcorr: -0.031622690 hartree
energy: -11427.175516197120
dipole: -138.43740 138.54869 0.11129 102.83927 -100.53445 2.30482 26.82745 -25.87727 0.95018
magnitude: 2.49548 au
magnitude: 6.34301 debye
