program: Orca
programVersion: 5.0.2
elementType: Br Br Br Br O O O N C C C C C C C C C C C C C C C C C C C C C C H H H H H H H H H H H H H H H H H H H
charge: 0
multiplicity: 1
keywords: wb97x-d3
keywords: def2-TZVPP
keywords: def2/J RIJCOSX
keywords: DEFGRID2
keywords: scfconv7
keywords: smallprint printgap noloewdin
keywords: NOSOSCF
formula: C22H19Br4NO3
InChI: InChI=1/C22H19Br4NO3/c1-21(2)17(19(23)22(24,25)26)18(21)20(28)30-16(12-27)13-7-6-10-15(11-13)29-14-8-4-3-5-9-14/h3-11,16-19H,1-2H3
49 atoms
Br 3.186605 0.713395 -0.676931
Br 0.82794 1.236956 1.793568
Br 0.843326 -1.843678 2.401718
Br 3.500148 -0.193659 2.610107
O  -1.798106 -1.777956 -0.638224
O  -1.350857 -3.954639 -0.79641
O  -3.969709 2.696031 -1.544659
N  -4.078849 -3.04491 -2.816157
C  1.011821 -1.641566 -2.062387
C  0.940668 -1.0055 -0.706908
C  0.4532 -2.420753 -0.884257
C  2.154108 -0.744784 0.136775
C  2.314046 -2.162513 -2.620838
C  0.093084 -1.095151 -3.128171
C  -0.964616 -2.814412 -0.769233
C  1.856423 -0.389678 1.603573
C  -3.190575 -2.048221 -0.565019
C  -3.881935 -0.739412 -0.282601
C  -3.665941 -2.619819 -1.832046
C  -3.612282 0.354873 -1.096054
C  -4.751968 -0.631046 0.790139
C  -4.193505 1.577947 -0.800298
C  -5.356465 0.592353 1.05056
C  -5.073021 1.699871 0.270755
C  -2.785351 2.840072 -2.22123
C  -2.84627 3.228595 -3.550027
C  -1.562089 2.65541 -1.588356
C  -1.66701 3.434205 -4.253625
C  -0.392506 2.84893 -2.307003
C  -0.438388 3.237299 -3.639965
H  0.169801 -0.246308 -0.625609
H  1.109863 -3.213049 -0.540538
H  2.820683 -1.611243 0.141262
H  2.850185 -1.378112 -3.155815
H  2.979669 -2.569368 -1.859668
H  2.112089 -2.966092 -3.331205
H  -0.818615 -0.65244 -2.730663
H  0.609702 -0.316776 -3.692336
H  -0.190421 -1.879404 -3.832382
H  -3.409664 -2.769675 0.227806
H  -2.950648 0.25014 -1.947756
H  -4.953752 -1.48771 1.420306
H  -6.039085 0.688846 1.884378
H  -5.527129 2.658442 0.488278
H  -3.807439 3.371735 -4.027736
H  -1.522292 2.365553 -0.545864
H  -1.714215 3.740499 -5.290575
H  0.56145 2.700172 -1.817436
H  0.478521 3.389819 -4.193763
elementType: Br O N C H
nucrepener: 5890.00631163 hartree
cpcmener: -0.03259097 hartree
xcener: -389.802858682284 hartree
chargesum: -0.0000000
charge: -0.083904 -0.019586 -0.012317 0.000312 -0.253622 -0.424243 -0.325733 -0.081429 0.139373 -0.059533 -0.193155 -0.161077 -0.268931 -0.258248 0.410592 0.054102 0.366408 0.011506 -0.223950 -0.221746 -0.199362 0.255254 -0.110667 -0.231385 0.282188 -0.243811 -0.187755 -0.109350 -0.118387 -0.191210 0.089568 0.122442 0.170174 0.098021 0.091128 0.110781 0.057480 0.100297 0.114651 0.133553 0.174554 0.146851 0.158472 0.147892 0.145767 0.142630 0.158362 0.140960 0.156085
qa: -0.0839 -0.0196 -0.0123 0.0003 -0.2536 -0.4242 -0.3257 -0.0814 0.1394 -0.0595 -0.1932 -0.1611 -0.2689 -0.2582 0.4106 0.0541 0.3664 0.0115 -0.2239 -0.2217 -0.1994 0.2553 -0.1107 -0.2314 0.2822 -0.2438 -0.1878 -0.1094 -0.1184 -0.1912 0.0896 0.1224 0.1702 0.0980 0.0911 0.1108 0.0575 0.1003 0.1147 0.1336 0.1746 0.1469 0.1585 0.1479 0.1458 0.1426 0.1584 0.1410 0.1561
va: 1.1823 1.2171 1.2281 1.2314 2.1548 2.0794 2.0937 3.1084 3.8164 3.6923 3.9740 4.0372 3.9081 3.9297 4.1413 4.3356 3.8003 3.7062 4.0199 3.9291 3.9554 3.7949 3.9029 4.0086 3.7384 4.0144 3.8974 3.8733 3.8121 3.9253 1.0398 1.0217 0.9919 1.0055 1.0042 1.0020 1.0098 1.0039 1.0056 1.0187 0.9834 1.0014 0.9894 1.0058 1.0076 0.9989 0.9881 1.0017 0.9916
dispcorr: -0.034691455 hartree
energy: -11427.178441989123
dipole: -92.39200 93.31124 0.91924 -0.57939 1.53732 0.95793 -87.54080 88.23256 0.69176
magnitude: 1.49705 au
magnitude: 3.80519 debye
