program: Orca
programVersion: 5.0.2
elementType: Br Br Br Br O O O N C C C C C C C C C C C C C C C C C C C C C C H H H H H H H H H H H H H H H H H H H
charge: 0
multiplicity: 1
keywords: wb97x-d3
keywords: def2-TZVPP
keywords: def2/J RIJCOSX
keywords: DEFGRID2
keywords: scfconv7
keywords: smallprint printgap noloewdin
keywords: NOSOSCF
formula: C22H19Br4NO3
InChI: InChI=1/C22H19Br4NO3/c1-21(2)17(19(23)22(24,25)26)18(21)20(28)30-16(12-27)13-7-6-10-15(11-13)29-14-8-4-3-5-9-14/h3-11,16-19H,1-2H3
49 atoms
Br 3.30975 0.092682 -1.144849
Br 0.637538 1.556814 0.488737
Br 0.558991 -0.879772 2.472402
Br 3.169161 0.824012 2.202384
O  -1.718202 -2.102672 -0.397382
O  -1.378108 -4.278244 -0.019541
O  -3.495982 2.638017 -0.532665
N  -3.840995 -3.184651 -2.76938
C  1.258922 -2.70942 -1.554901
C  1.046805 -1.521907 -0.662595
C  0.507191 -2.861095 -0.24792
C  2.154426 -0.875986 0.11585
C  2.595919 -3.405031 -1.631143
C  0.502573 -2.721081 -2.86057
C  -0.937067 -3.174681 -0.207802
C  1.67317 0.0941 1.208559
C  -3.118074 -2.300424 -0.413561
C  -3.823605 -0.994392 -0.130895
C  -3.514011 -2.80805 -1.734438
C  -3.259799 0.221467 -0.502041
C  -5.069414 -1.047889 0.476188
C  -3.967382 1.392184 -0.258154
C  -5.76255 0.130488 0.711345
C  -5.220669 1.348816 0.344867
C  -2.441662 2.857352 -1.377992
C  -2.385323 2.307695 -2.652051
C  -1.457673 3.732501 -0.937668
C  -1.315335 2.624378 -3.477307
C  -0.400291 4.050256 -1.779617
C  -0.320024 3.491083 -3.047142
H  0.317166 -0.819971 -1.050567
H  1.057226 -3.411875 0.508219
H  2.792026 -1.624127 0.594542
H  3.231307 -2.946203 -2.389471
H  3.138997 -3.398304 -0.685833
H  2.452063 -4.450177 -1.911123
H  1.099466 -2.24417 -3.639884
H  0.297478 -3.744323 -3.180542
H  -0.447416 -2.188686 -2.810871
H  -3.421903 -3.044916 0.328334
H  -2.285078 0.251505 -0.969547
H  -5.496263 -1.99995 0.765684
H  -6.733132 0.099859 1.188236
H  -5.756659 2.270429 0.533778
H  -3.165204 1.644663 -3.005626
H  -1.532315 4.175393 0.048221
H  -1.269249 2.193936 -4.469381
H  0.363951 4.736233 -1.437775
H  0.507931 3.735118 -3.699546
elementType: Br O N C H
nucrepener: 5986.20306243 hartree
cpcmener: -0.03118387 hartree
xcener: -389.802955991643 hartree
chargesum: 0.0000000
charge: -0.086801 -0.022978 -0.020277 -0.008617 -0.249759 -0.423840 -0.314244 -0.084550 0.097979 -0.079304 -0.177852 -0.155246 -0.275620 -0.253265 0.406137 0.067029 0.346673 0.011898 -0.219748 -0.211669 -0.216743 0.339583 -0.107360 -0.248068 0.336986 -0.215314 -0.328416 -0.139489 -0.104635 -0.163888 0.116324 0.127388 0.167035 0.099066 0.090545 0.109468 0.100630 0.106990 0.082424 0.137387 0.117461 0.144205 0.158033 0.146243 0.159659 0.160748 0.159788 0.159383 0.158618
qa: -0.0868 -0.0230 -0.0203 -0.0086 -0.2498 -0.4238 -0.3142 -0.0845 0.0980 -0.0793 -0.1779 -0.1552 -0.2756 -0.2533 0.4061 0.0670 0.3467 0.0119 -0.2197 -0.2117 -0.2167 0.3396 -0.1074 -0.2481 0.3370 -0.2153 -0.3284 -0.1395 -0.1046 -0.1639 0.1163 0.1274 0.1670 0.0991 0.0905 0.1095 0.1006 0.1070 0.0824 0.1374 0.1175 0.1442 0.1580 0.1462 0.1597 0.1607 0.1598 0.1594 0.1586
va: 1.1799 1.2319 1.2224 1.2279 2.1528 2.0835 2.1032 3.1045 3.8782 3.7190 3.9125 4.0460 3.9035 3.9060 4.1731 4.3311 3.7645 3.8048 4.0163 3.9660 3.9817 3.6796 3.9037 3.9904 3.5880 3.9169 3.9207 3.8738 3.8112 3.8963 1.0213 1.0173 0.9937 1.0048 1.0039 1.0024 1.0040 1.0021 1.0120 1.0258 1.0189 1.0018 0.9891 1.0079 0.9957 1.0056 0.9894 0.9896 0.9885
dispcorr: -0.034312723 hartree
energy: -11427.177133192157
dipole: -84.16903 84.83116 0.66213 -25.37810 25.97729 0.59919 -61.23748 61.80161 0.56413
magnitude: 1.05626 au
magnitude: 2.68481 debye
